program: Orca
programVersion: 5.0.2
elementType: S P O O O N N C C C C C C C C C C C C H H H H H H H H H H H H H H H
charge: 0
multiplicity: 1
keywords: wb97x-d3
keywords: def2-TZVPP
keywords: def2/J RIJCOSX
keywords: DEFGRID2
keywords: scfconv7
keywords: smallprint printgap noloewdin
keywords: NOSOSCF
formula: C12H15N2O3PS
InChI: InChI=1/C12H15N2O3PS/c1-3-15-18(19,16-4-2)17-14-12(10-13)11-8-6-5-7-9-11/h5-9H,3-4H2,1-2H3
34 atoms
S  -3.463486 -0.628704 0.993945
P  -1.946199 0.227498 0.213299
O  -1.933773 0.436376 -1.361657
O  -1.50647 1.655179 0.744146
O  -0.588213 -0.643239 0.554753
N  0.550071 -0.135647 -0.015075
N  1.470435 -2.48163 2.307075
C  -2.544002 -0.500984 -2.278441
C  -2.468788 2.645118 1.175874
C  2.925268 -0.300411 -0.061433
C  -1.76111 -1.783365 -2.408972
C  -3.265405 3.219456 0.031966
C  3.038466 0.392783 -1.268406
C  4.072258 -0.607629 0.667767
C  1.604674 -0.683679 0.44808
C  4.284492 0.775863 -1.729654
C  5.317788 -0.217045 0.20039
C  5.426995 0.474088 -0.996702
C  1.520518 -1.681284 1.481274
H  -3.56974 -0.694189 -1.959926
H  -2.580211 0.031381 -3.226522
H  -3.121672 2.200422 1.928853
H  -1.869405 3.412546 1.66044
H  -2.217383 -2.389389 -3.192196
H  -0.726363 -1.595492 -2.69452
H  -1.772613 -2.373183 -1.492004
H  -3.882683 4.03345 0.412781
H  -2.618897 3.625272 -0.745446
H  -3.935512 2.484318 -0.414819
H  2.157483 0.621697 -1.852441
H  4.004996 -1.142236 1.606922
H  4.36592 1.307515 -2.668047
H  6.202227 -0.455477 0.775275
H  6.399807 0.774304 -1.362588
elementType: S P O N C H
totalener: -1541.15127003 hartree
nucrepener: 1725.39216521 hartree
electener: -3266.54343524 hartree
oneelecener: -5543.87307027 hartree
twoeener: 2277.32963503 hartree
cpcmener: -0.02712465 hartree
kineticenergy: 1536.27653311 hartree
xcener: -112.516303737902 hartree
chargesum: 0.0000000
charge: -0.411660 0.734118 -0.336322 -0.340941 -0.245314 -0.139940 -0.069760 0.038585 0.025917 -0.021515 -0.242627 -0.234776 -0.160022 -0.164250 0.440398 -0.148280 -0.155470 -0.131461 -0.193478 0.097846 0.113660 0.096890 0.113066 0.104686 0.090597 0.083848 0.100308 0.092846 0.079639 0.149904 0.141858 0.163622 0.163864 0.164164
qa: -0.4117 0.7341 -0.3363 -0.3409 -0.2453 -0.1399 -0.0698 0.0386 0.0259 -0.0215 -0.2426 -0.2348 -0.1600 -0.1642 0.4404 -0.1483 -0.1555 -0.1315 -0.1935 0.0978 0.1137 0.0969 0.1131 0.1047 0.0906 0.0838 0.1003 0.0928 0.0796 0.1499 0.1419 0.1636 0.1639 0.1642
va: 2.0283 5.5129 2.0779 2.1174 2.0652 2.8964 3.0894 3.8364 3.8623 3.7374 3.9061 3.8871 3.9429 3.9521 3.7488 3.9075 3.9171 3.9047 4.0562 1.0106 0.9918 1.0079 0.9911 1.0100 1.0062 1.0153 1.0087 1.0061 1.0163 1.0172 1.0124 0.9909 0.9910 0.9878
dispcorr: -0.014979181 hartree
energy: -1541.166249214987
dipole: -1.50323 2.58062 1.07739 8.87140 -7.02124 1.85016 -12.58473 10.39634 -2.18839
magnitude: 3.06152 au
magnitude: 7.78176 debye
