program: Orca
programVersion: 5.0.2
elementType: S P O O O N N C C C C C C C C C C C C H H H H H H H H H H H H H H H
charge: 0
multiplicity: 1
keywords: wb97x-d3
keywords: def2-TZVPP
keywords: def2/J RIJCOSX
keywords: DEFGRID2
keywords: scfconv7
keywords: smallprint printgap noloewdin
keywords: NOSOSCF
formula: C12H15N2O3PS
InChI: InChI=1/C12H15N2O3PS/c1-3-15-18(19,16-4-2)17-14-12(10-13)11-8-6-5-7-9-11/h5-9H,3-4H2,1-2H3
34 atoms
S  -2.067385 -0.502438 2.441178
P  -2.07065 0.02265 0.605819
O  -2.228217 -1.108262 -0.496878
O  -3.127363 1.141484 0.252411
O  -0.712943 0.814649 0.076557
N  0.420473 0.072094 0.198302
N  1.177502 2.910787 -1.547513
C  -2.353383 -2.521547 -0.220826
C  -3.365066 1.660864 -1.085534
C  2.759979 0.016624 -0.265972
C  -1.004938 -3.190636 -0.169332
C  -2.86284 3.076452 -1.19889
C  3.830132 0.571269 -0.965242
C  2.959484 -1.136128 0.497879
C  1.43407 0.639463 -0.330224
C  5.083427 -0.019486 -0.903613
C  4.211715 -1.718778 0.555055
C  5.277823 -1.162509 -0.143855
C  1.2844 1.904852 -0.998951
H  -2.905441 -2.667078 0.708303
H  -2.957823 -2.912727 -1.036995
H  -2.906117 1.01961 -1.838388
H  -4.443727 1.614379 -1.225039
H  -0.412858 -2.845626 0.67809
H  -1.149437 -4.265677 -0.059614
H  -0.439203 -3.021439 -1.08534
H  -1.778255 3.134976 -1.11543
H  -3.14161 3.467505 -2.177781
H  -3.309308 3.723167 -0.443957
H  3.698229 1.46287 -1.565102
H  2.140766 -1.573267 1.053129
H  5.907008 0.418146 -1.451183
H  4.359006 -2.608838 1.151704
H  6.256487 -1.620787 -0.093006
elementType: S P O N C H
totalener: -1541.15061283 hartree
nucrepener: 1732.87566644 hartree
electener: -3274.02627927 hartree
oneelecener: -5558.60175117 hartree
twoeener: 2284.57547189 hartree
cpcmener: -0.02554187 hartree
kineticenergy: 1536.26591410 hartree
xcener: -112.516131032067 hartree
chargesum: 0.0000000
charge: -0.420246 0.733537 -0.337095 -0.348828 -0.228100 -0.126574 -0.083423 0.056567 0.043833 -0.023685 -0.237035 -0.239380 -0.165569 -0.156029 0.433875 -0.151289 -0.154713 -0.132327 -0.195080 0.091581 0.110804 0.104282 0.108833 0.069322 0.104366 0.091195 0.077333 0.096051 0.090337 0.141228 0.155590 0.163336 0.162939 0.164362
qa: -0.4202 0.7335 -0.3371 -0.3488 -0.2281 -0.1266 -0.0834 0.0566 0.0438 -0.0237 -0.2370 -0.2394 -0.1656 -0.1560 0.4339 -0.1513 -0.1547 -0.1323 -0.1951 0.0916 0.1108 0.1043 0.1088 0.0693 0.1044 0.0912 0.0773 0.0961 0.0903 0.1412 0.1556 0.1633 0.1629 0.1644
va: 2.0170 5.5131 2.0849 2.1315 2.0650 2.9556 3.0818 3.8302 3.8359 3.7531 3.9076 3.9433 3.9443 3.9322 3.7552 3.9116 3.9165 3.9064 4.0438 1.0129 0.9927 1.0019 0.9957 1.0143 1.0115 1.0050 1.0084 1.0078 1.0056 1.0128 1.0108 0.9911 0.9912 0.9877
dispcorr: -0.015718384 hartree
energy: -1541.166331216921
dipole: 0.76794 0.05275 0.82069 -6.70972 4.99447 -1.71525 -8.77685 7.11018 -1.66667
magnitude: 2.52852 au
magnitude: 6.42699 debye
