program: Orca
programVersion: 5.0.2
elementType: S P O O O N N C C C C C C C C C C C C H H H H H H H H H H H H H H H
charge: 0
multiplicity: 1
keywords: wb97x-d3
keywords: def2-TZVPP
keywords: def2/J RIJCOSX
keywords: DEFGRID2
keywords: scfconv7
keywords: smallprint printgap noloewdin
keywords: NOSOSCF
formula: C12H15N2O3PS
InChI: InChI=1/C12H15N2O3PS/c1-3-15-18(19,16-4-2)17-14-12(10-13)11-8-6-5-7-9-11/h5-9H,3-4H2,1-2H3
34 atoms
S  -1.874237 0.553749 2.579952
P  -2.0676 0.460726 0.683512
O  -2.527337 -0.913535 0.038969
O  -3.013776 1.553932 0.05098
O  -0.698511 0.841793 -0.17628
N  0.421517 0.193156 0.235373
N  1.11795 1.873482 -2.65104
C  -2.543808 -2.192963 0.711554
C  -3.705087 1.470786 -1.222265
C  2.731469 -0.168721 -0.243895
C  -1.22793 -2.91335 0.566944
C  -2.783872 1.475638 -2.417748
C  2.936461 -0.897944 0.930617
C  3.78899 0.010547 -1.133568
C  1.415745 0.4085 -0.535661
C  4.181489 -1.433711 1.202462
C  5.035187 -0.530188 -0.853825
C  5.235087 -1.25144 0.312833
C  1.248716 1.228247 -1.707004
H  -2.80473 -2.04891 1.760982
H  -3.350178 -2.746598 0.234697
H  -4.351232 0.592592 -1.219913
H  -4.342122 2.352796 -1.228427
H  -0.939525 -3.014433 -0.479469
H  -0.42649 -2.407908 1.105125
H  -1.329194 -3.915418 0.984015
H  -3.398354 1.561593 -3.314327
H  -2.103517 2.326693 -2.400833
H  -2.204421 0.557682 -2.507113
H  2.128052 -1.042024 1.634634
H  3.653082 0.570941 -2.05011
H  4.333039 -1.99372 2.11559
H  5.848367 -0.383754 -1.551732
H  6.208272 -1.670024 0.532377
elementType: S P O N C H
totalener: -1541.14906103 hartree
nucrepener: 1739.12448629 hartree
electener: -3280.27354732 hartree
oneelecener: -5571.18486396 hartree
twoeener: 2290.91131664 hartree
cpcmener: -0.02613520 hartree
kineticenergy: 1536.26429782 hartree
xcener: -112.517152666460 hartree
chargesum: -0.0000000
charge: -0.419945 0.725661 -0.324830 -0.348755 -0.223408 -0.127733 -0.081700 0.048469 0.041484 -0.025096 -0.230964 -0.254989 -0.147780 -0.164253 0.438301 -0.155938 -0.153914 -0.131872 -0.202260 0.092134 0.108001 0.101850 0.111139 0.092731 0.069366 0.102705 0.105207 0.087733 0.088087 0.148940 0.140776 0.162553 0.163498 0.164800
qa: -0.4199 0.7257 -0.3248 -0.3488 -0.2234 -0.1277 -0.0817 0.0485 0.0415 -0.0251 -0.2310 -0.2550 -0.1478 -0.1643 0.4383 -0.1559 -0.1539 -0.1319 -0.2023 0.0921 0.1080 0.1019 0.1111 0.0927 0.0694 0.1027 0.1052 0.0877 0.0881 0.1489 0.1408 0.1626 0.1635 0.1648
va: 2.0289 5.5124 2.0821 2.1393 2.0550 2.9431 3.0845 3.8448 3.8529 3.7558 3.9118 3.8948 3.9236 3.9412 3.7470 3.9143 3.9174 3.9041 4.0499 1.0116 0.9916 0.9992 0.9871 1.0049 1.0112 1.0109 1.0101 1.0056 1.0139 1.0179 1.0130 0.9912 0.9911 0.9876
dispcorr: -0.016119558 hartree
energy: -1541.165180585812
dipole: -0.64713 1.03263 0.38550 -11.65580 9.43035 -2.22545 -7.11071 6.26881 -0.84190
magnitude: 2.41040 au
magnitude: 6.12675 debye
