program: Orca
programVersion: 5.0.2
elementType: S P O O O N N C C C C C C C C C C C C H H H H H H H H H H H H H H H
charge: 0
multiplicity: 1
keywords: wb97x-d3
keywords: def2-TZVPP
keywords: def2/J RIJCOSX
keywords: DEFGRID2
keywords: scfconv7
keywords: smallprint printgap noloewdin
keywords: NOSOSCF
formula: C12H15N2O3PS
InChI: InChI=1/C12H15N2O3PS/c1-3-15-18(19,16-4-2)17-14-12(10-13)11-8-6-5-7-9-11/h5-9H,3-4H2,1-2H3
34 atoms
S  -3.435089 -0.666181 1.235739
P  -1.985838 -0.212799 0.07866
O  -1.733415 -1.077267 -1.225855
O  -1.905186 1.272976 -0.4785
O  -0.553548 -0.457498 0.858603
N  0.524833 -0.066404 0.115842
N  1.729922 -1.685508 2.88455
C  -2.811561 -1.551992 -2.062306
C  -2.347308 2.42261 0.276745
C  2.898253 -0.031645 -0.017499
C  -3.481986 -0.446141 -2.836759
C  -1.43834 2.749111 1.434702
C  2.87637 0.689742 -1.213873
C  4.120106 -0.40777 0.534635
C  1.636914 -0.389569 0.645158
C  4.061416 1.024569 -1.841157
C  5.305757 -0.06806 -0.10104
C  5.280192 0.646274 -1.288208
C  1.677324 -1.1073 1.892833
H  -2.338616 -2.26654 -2.733744
H  -3.529067 -2.09562 -1.443925
H  -2.359089 3.234229 -0.448901
H  -3.372808 2.256839 0.612254
H  -4.185461 -0.891936 -3.541231
H  -4.049653 0.227711 -2.194429
H  -2.76193 0.13787 -3.409912
H  -1.475192 1.992048 2.219008
H  -0.404001 2.873673 1.113438
H  -1.763834 3.691157 1.87822
H  1.935866 0.992029 -1.654146
H  4.164095 -0.968081 1.46031
H  4.03514 1.584742 -2.76647
H  6.249383 -0.365649 0.336254
H  6.205452 0.910951 -1.783144
elementType: S P O N C H
totalener: -1541.16140830 hartree
nucrepener: 1728.36019750 hartree
electener: -3269.52160580 hartree
oneelecener: -5549.65318880 hartree
twoeener: 2280.13158300 hartree
cpcmener: -0.02307303 hartree
kineticenergy: 1536.28407923 hartree
xcener: -112.517975231452 hartree
chargesum: 0.0000000
charge: -0.402613 0.725398 -0.331597 -0.329841 -0.243622 -0.129040 -0.055096 0.022832 0.035344 -0.033101 -0.235210 -0.243712 -0.150774 -0.164374 0.426046 -0.145124 -0.148155 -0.133349 -0.203618 0.110344 0.095810 0.110322 0.097240 0.099144 0.080640 0.091975 0.086346 0.090411 0.103422 0.151900 0.139819 0.159844 0.160693 0.161699
qa: -0.4026 0.7254 -0.3316 -0.3298 -0.2436 -0.1290 -0.0551 0.0228 0.0353 -0.0331 -0.2352 -0.2437 -0.1508 -0.1644 0.4260 -0.1451 -0.1482 -0.1333 -0.2036 0.1103 0.0958 0.1103 0.0972 0.0991 0.0806 0.0920 0.0863 0.0904 0.1034 0.1519 0.1398 0.1598 0.1607 0.1617
va: 2.0422 5.5207 2.1271 2.0818 2.0660 2.8916 3.0946 3.8728 3.8460 3.7787 3.8886 3.9018 3.9336 3.9516 3.7653 3.9068 3.9215 3.9131 4.0595 0.9902 1.0073 0.9915 1.0102 1.0090 1.0147 1.0061 1.0156 1.0066 1.0101 1.0200 1.0138 0.9923 0.9921 0.9888
dispcorr: -0.015091545 hartree
energy: -1541.176499847779
dipole: -1.72013 2.57019 0.85006 10.93719 -9.25664 1.68055 -11.83278 9.39841 -2.43437
magnitude: 3.07783 au
magnitude: 7.82322 debye
