program: Orca
programVersion: 5.0.2
elementType: S P O O O N N C C C C C C C C C C C C H H H H H H H H H H H H H H H
charge: 0
multiplicity: 1
keywords: wb97x-d3
keywords: def2-TZVPP
keywords: def2/J RIJCOSX
keywords: DEFGRID2
keywords: scfconv7
keywords: smallprint printgap noloewdin
keywords: NOSOSCF
formula: C12H15N2O3PS
InChI: InChI=1/C12H15N2O3PS/c1-3-15-18(19,16-4-2)17-14-12(10-13)11-8-6-5-7-9-11/h5-9H,3-4H2,1-2H3
34 atoms
S  -1.927555 -0.560837 2.136823
P  -1.907843 -0.381874 0.233194
O  -2.838884 -1.321541 -0.639303
O  -2.153543 1.065408 -0.37187
O  -0.519437 -0.870163 -0.520306
N  0.553842 -0.172673 -0.063317
N  1.692041 -2.27804 -2.515436
C  -4.11955 -1.781967 -0.155697
C  -2.14069 2.300877 0.372875
C  2.902874 0.133514 -0.227815
C  -5.13897 -0.673719 -0.07046
C  -0.79011 2.967266 0.316642
C  4.015215 0.096966 -1.065531
C  2.985744 0.785454 1.004419
C  1.642537 -0.496181 -0.63881
C  5.194827 0.716276 -0.680024
C  4.166227 1.398742 1.382616
C  5.272972 1.367563 0.541734
C  1.65972 -1.487784 -1.6816
H  -4.42576 -2.54125 -0.872837
H  -3.982979 -2.268557 0.812127
H  -2.903797 2.920725 -0.095944
H  -2.447636 2.112818 1.403548
H  -6.104167 -1.105243 0.197718
H  -4.886463 0.060923 0.695831
H  -5.256178 -0.15942 -1.024413
H  -0.862991 3.951035 0.782153
H  -0.03187 2.398821 0.854041
H  -0.456304 3.109711 -0.711678
H  3.970328 -0.404383 -2.02461
H  2.134941 0.798347 1.672887
H  6.0533 0.68678 -1.337775
H  4.225897 1.896312 2.341587
H  6.195938 1.845162 0.843847
elementType: S P O N C H
totalener: -1541.16025146 hartree
nucrepener: 1727.60057373 hartree
electener: -3268.76082519 hartree
oneelecener: -5548.10287966 hartree
twoeener: 2279.34205447 hartree
cpcmener: -0.02175696 hartree
kineticenergy: 1536.29232028 hartree
xcener: -112.521162230356 hartree
chargesum: -0.0000000
charge: -0.428450 0.742829 -0.334464 -0.333106 -0.234936 -0.121052 -0.058181 0.031204 0.053327 0.001223 -0.235158 -0.233741 -0.168816 -0.163500 0.404282 -0.151472 -0.145564 -0.131202 -0.196237 0.108985 0.097800 0.109525 0.089044 0.098713 0.076771 0.093187 0.100240 0.072478 0.091916 0.140067 0.142980 0.160368 0.159687 0.161255
qa: -0.4285 0.7428 -0.3345 -0.3331 -0.2349 -0.1211 -0.0582 0.0312 0.0533 0.0012 -0.2352 -0.2337 -0.1688 -0.1635 0.4043 -0.1515 -0.1456 -0.1312 -0.1962 0.1090 0.0978 0.1095 0.0890 0.0987 0.0768 0.0932 0.1002 0.0725 0.0919 0.1401 0.1430 0.1604 0.1597 0.1613
va: 1.9951 5.5184 2.1290 2.1008 2.1000 2.9244 3.0918 3.8602 3.8308 3.7138 3.8926 3.9266 3.9610 3.9356 3.7820 3.9206 3.9144 3.9112 4.0708 0.9924 1.0083 0.9915 1.0136 1.0092 1.0160 1.0059 1.0109 1.0099 1.0058 1.0128 1.0206 0.9919 0.9919 0.9887
dispcorr: -0.015378414 hartree
energy: -1541.175629876440
dipole: -6.61091 6.53156 -0.07935 13.01763 -11.03041 1.98721 2.66362 -2.14014 0.52348
magnitude: 2.05654 au
magnitude: 5.22730 debye
