program: Orca
programVersion: 5.0.2
elementType: S P O O O N N C C C C C C C C C C C C H H H H H H H H H H H H H H H
charge: 0
multiplicity: 1
keywords: wb97x-d3
keywords: def2-TZVPP
keywords: def2/J RIJCOSX
keywords: DEFGRID2
keywords: scfconv7
keywords: smallprint printgap noloewdin
keywords: NOSOSCF
formula: C12H15N2O3PS
InChI: InChI=1/C12H15N2O3PS/c1-3-15-18(19,16-4-2)17-14-12(10-13)11-8-6-5-7-9-11/h5-9H,3-4H2,1-2H3
34 atoms
S  -1.91375 0.656339 2.068255
P  -1.865612 0.387214 0.176448
O  -3.027932 -0.459626 -0.492108
O  -1.757218 1.657323 -0.764971
O  -0.588511 -0.487235 -0.395362
N  0.616532 0.04482 -0.050685
N  1.171874 -2.880079 -1.726714
C  -3.720749 -1.523801 0.198153
C  -2.376494 2.919104 -0.435099
C  2.97723 -0.266953 -0.164648
C  -2.874798 -2.762119 0.358772
C  -3.880133 2.865085 -0.536119
C  3.23261 0.901596 0.557414
C  4.043241 -1.041764 -0.617057
C  1.594468 -0.673756 -0.440399
C  4.53559 1.28077 0.819797
C  5.348173 -0.654815 -0.349244
C  5.597636 0.504058 0.368726
C  1.353659 -1.899267 -1.157161
H  -4.07053 -1.155064 1.164391
H  -4.593629 -1.725553 -0.419873
H  -2.056117 3.225197 0.562696
H  -1.96009 3.623273 -1.153089
H  -3.493605 -3.554224 0.782231
H  -2.488724 -3.115298 -0.597461
H  -2.036902 -2.606353 1.039233
H  -4.205183 2.520111 -1.51782
H  -4.322201 2.221957 0.226035
H  -4.278374 3.869087 -0.385089
H  2.414852 1.512271 0.916093
H  3.870626 -1.951633 -1.178539
H  4.724834 2.186816 1.380223
H  6.168764 -1.264158 -0.703971
H  6.616089 0.804702 0.577713
elementType: S P O N C H
totalener: -1541.16218668 hartree
nucrepener: 1719.64367512 hartree
electener: -3260.80586180 hartree
oneelecener: -5532.44285951 hartree
twoeener: 2271.63699770 hartree
cpcmener: -0.02129323 hartree
kineticenergy: 1536.29343960 hartree
xcener: -112.520264415286 hartree
chargesum: 0.0000000
charge: -0.424608 0.749941 -0.334399 -0.340407 -0.236698 -0.118920 -0.064498 0.035699 0.029451 -0.039044 -0.235703 -0.234478 -0.146892 -0.163358 0.433766 -0.147668 -0.150266 -0.130721 -0.206211 0.094968 0.110409 0.097092 0.109452 0.099579 0.090714 0.081693 0.092777 0.079147 0.098005 0.148939 0.140437 0.160060 0.160881 0.160862
qa: -0.4246 0.7499 -0.3344 -0.3404 -0.2367 -0.1189 -0.0645 0.0357 0.0295 -0.0390 -0.2357 -0.2345 -0.1469 -0.1634 0.4338 -0.1477 -0.1503 -0.1307 -0.2062 0.0950 0.1104 0.0971 0.1095 0.0996 0.0907 0.0817 0.0928 0.0791 0.0980 0.1489 0.1404 0.1601 0.1609 0.1609
va: 2.0033 5.5078 2.1164 2.1284 2.0918 2.9339 3.0879 3.8507 3.8656 3.7710 3.8958 3.8953 3.9366 3.9504 3.7686 3.9092 3.9224 3.9118 4.0466 1.0092 0.9918 1.0089 0.9922 1.0100 1.0072 1.0176 1.0062 1.0160 1.0090 1.0224 1.0136 0.9922 0.9921 0.9891
dispcorr: -0.014784184 hartree
energy: -1541.176970867665
dipole: -7.46994 7.66547 0.19553 3.71185 -2.56917 1.14268 0.20514 -0.16165 0.04349
magnitude: 1.16010 au
magnitude: 2.94874 debye
