program: Gaussian 09
title: 000066190
version: EM64L-G09RevD.01
frameworkgroup: C1[X(C8H16Si)]
method: RPBEPBE
basis: SDD
operation: Freq
keyword: #pfreq=noraman
keyword: PBEPBE/SDD
title: #p freq=noraman PBEPBE/SDD
converged: YES YES NO NO
title: Mulliken charges:
elementType: Si C C C C C C C C H H H H H H H H H H H H H H H H
charge: 1.258020 -0.844550 -0.844559 -1.034417 -1.034417 0.004021 0.004023 -0.588737 -0.588736 0.230950 0.250165 0.230951 0.250168 0.244416 0.237138 0.233942 0.237138 0.233943 0.244417 0.210728 0.210725 0.213641 0.213695 0.213641 0.213696
chargesum: 0.00000
title: Mulliken charges with hydrogens summed into heavy atoms:
elementType: Si C C C C C C C C
charge: 1.258020 -0.363435 -0.363440 -0.318921 -0.318920 0.214749 0.214748 -0.161401 -0.161399
polarizability: 1.36961115e+02 -1.06020964e-02 1.06537901e+02 2.35008513e-03 9.02724087e+00 8.77478305e+01
1716.lowfreq: 0.0007 0.0007 0.0018 15.4792 16.5108 17.6396 44.6393 64.1617 67.5359
frequency: 44.0279 63.8264 67.5106 79.3217 120.4210 120.8706 137.9303 150.1991 175.8390 198.4867 212.0314 271.2434 316.7866 392.9264 394.2606 516.1187 583.4597 644.3735 695.8532 714.1358 722.2617 739.1855 805.9362 827.4061 834.5750 900.8422 903.6166 921.5707 922.9387 931.4651 934.6319 998.4990 1000.1937 1046.8820 1056.6220 1176.5496 1177.1339 1206.1919 1206.8993 1291.0249 1293.1957 1295.8692 1301.1840 1411.1649 1412.6963 1441.8188 1443.4166 1447.5927 1448.8391 1454.1936 1458.6409 1643.8825 1644.3082 2973.7409 2973.9560 2978.5998 2979.5599 3041.5388 3041.6627 3074.0237 3074.6323 3079.3831 3081.5590 3084.5047 3084.5271 3089.7013 3089.8173 3193.3271 3194.6098
redmass: 3.2236 2.4278 2.7533 2.8088 1.1547 1.0704 2.2366 1.7478 2.4949 2.7381 2.4552 2.6826 2.6116 1.8793 1.9541 2.3801 2.0411 2.4813 3.1128 2.0977 1.6982 1.3638 1.3380 1.8507 1.4954 1.5643 1.4509 1.3990 1.3500 1.8815 2.0698 1.1134 1.1121 1.3910 1.3661 1.3464 1.4153 1.4199 1.3967 1.2164 1.2209 1.2024 1.1924 1.1434 1.1418 1.1260 1.1231 1.0586 1.0636 1.0507 1.0511 4.5332 4.5291 1.0591 1.0586 1.0344 1.0346 1.0982 1.0984 1.0768 1.0769 1.0980 1.0978 1.0962 1.0972 1.0783 1.0773 1.1146 1.1146
irintensity: 0.0150 0.0839 0.1063 0.1095 0.0242 0.0256 0.3285 0.3784 0.0008 3.0098 0.9981 1.5270 3.8668 2.1811 3.9989 0.1527 52.8325 12.4656 15.3033 0.8299 7.8241 6.4372 3.3043 42.2754 31.6333 38.3594 109.8141 222.1123 5.7338 1.4038 32.6887 23.9611 0.9122 60.6103 0.0456 49.4697 47.5850 8.8958 3.0600 9.5307 0.0654 34.3147 24.8282 10.9972 0.3758 8.4906 14.5510 12.0075 1.2409 3.6296 18.0625 50.8208 15.4277 32.7698 1.6220 18.1231 16.0904 5.7157 1.0626 31.4397 23.0805 1.3720 33.9593 16.1698 19.1021 10.3332 4.9995 64.7424 0.0203
temp: 298.150 k
press: 1.00000 atm
elementType: 14 6 6 6 6 6 6 6 6 1 1 1 1 1 1 1 1 1 1 1 1 1 1 1 1
symmnumber: 1
zpe: 557675.1 jmol-1
zpe.correction: 0.212407 hartree
zpe.thermalcorrener: 0.226125 hartree
zpe.thermalcorrenthalpy: 0.227069 hartree
zpe.thermalcorrgfe: 0.171854 hartree
zpe.sumelectzpe: -603.085619 hartree
zpe.sumelectthermal: -603.071901 hartree
zpe.sumelectthermalent: -603.070957 hartree
zpe.sumelectthermalfe: -603.126173 hartree
dipole: 1.2361 -0.0004 0.0000
dipole: 1.2361
quadrupole: -64.8034 -66.0140 -66.5879
quadrupole: -0.0003 0.0007 2.4279
quadrupole: 0.9984 -0.2123 -0.7861 -0.0003 0.0007 2.4279
hfenergy: -603.2980263 hartree
pointgroup: C01 [X(C8H16Si1)]
dipole: -0.4863077 0.0000732 -0.000015 debye
dipolederiv: 1.4256633 -0.0000262 0.0000006 0.0000079 1.3642614 -0.082041 0.0000316 0.1616353 1.0984335 -0.4399414 -0.1821672 0.0433379 -0.2476249 -0.4343548 0.1011954 0.0627412 0.0680555 -0.2402151 -0.439807 0.182172 -0.0433164 0.2476234 -0.4344996 0.1012377 -0.0627153 0.0680746 -0.2402123 -0.4095758 0.0607059 -0.0765063 0.0730268 -0.3655591 0.0867759 -0.0624727 0.0314593 -0.3493722 -0.4096223 -0.0606936 0.0765273 -0.0730154 -0.365517 0.0867483 0.0624795 0.0314359 -0.3493646 0.2591759 0.0515768 -0.0605461 0.1193452 0.1228031 -0.200029 -0.3120874 -0.4253768 0.0155237 0.2590876 -0.0515823 0.0605178 -0.1193886 0.1229125 -0.2000564 0.3119854 -0.4254641 0.0155211 -0.2709609 -0.2009011 0.0097575 -0.1040469 -0.1442667 -0.2483556 0.0330933 -0.2077632 -0.2265616 -0.2708773 0.2009717 -0.0098121 0.1041158 -0.1443094 -0.2483317 -0.0331421 -0.2077185 -0.2266038 0.0683037 0.0570653 0.0824738 0.0762218 -0.0105414 -0.0840099 0.1524239 -0.0333537 -0.0299789 -0.0390742 0.0667286 -0.1052292 0.0142674 0.0749359 0.0632761 -0.0301348 0.0960324 0.0024921 0.068291 -0.0570758 -0.0824901 -0.0762313 -0.0104992 -0.0839933 -0.1524308 -0.0333153 -0.0300108 -0.0391057 -0.0667061 0.1052367 -0.0142417 0.0749548 0.063246 0.0301525 0.0960228 0.0025135 0.0774274 -0.048089 0.0829512 -0.0577589 0.0384282 0.0958582 0.1043465 0.0897377 -0.0332199 -0.0191503 -0.0981949 -0.0880127 -0.0946041 0.038605 -0.0736349 -0.1022832 -0.086478 0.0346404 -0.004024 0.1286676 0.0465874 0.1303316 -0.0450427 -0.0573507 0.0362327 -0.0384599 0.0680951 -0.0191001 0.0982191 0.0879884 0.0946217 0.0385483 -0.0736574 0.102258 -0.0865093 0.0346469 -0.0040988 -0.1286796 -0.0466072 -0.1303432 -0.0449646 -0.0573396 -0.0362475 -0.0384497 0.0680922 0.0774661 0.0480714 -0.0829218 0.057739 0.0383963 0.0958843 -0.1043139 0.0897731 -0.0332241 -0.0018123 0.1126804 -0.0402735 0.0597083 -0.0143527 0.1098074 -0.013424 0.1309137 0.0606709 -0.0018642 -0.1127028 0.0402851 -0.0597246 -0.014333 0.1097853 0.0134437 0.1308939 0.060697 0.0345858 -0.0436097 0.0666324 -0.0422532 0.0435899 0.1347745 0.1080094 0.1705311 0.0614392 0.0322197 0.0892908 -0.0159436 0.1083169 0.0136145 0.1127195 -0.0360837 0.123894 0.0872658 0.034632 0.0435945 -0.0665966 0.042247 0.0435416 0.134796 -0.1079634 0.1705634 0.0614413 0.0321615 -0.0893159 0.0159595 -0.10834 0.0136489 0.1126945 0.0361011 0.123866 0.0872907 unknown
polarizability: 136.961118|-0.0041601|104.2129989|0.0007087|-10.9439906|90.072729 unknown
InChI: InChI=1S/C8H16Si/c1-5-7-9(3,4)8-6-2/h5-6H,1-2,7-8H2,3-4H3
charge 0 multiplicity 1
25 atoms
Si -1.13661 0.000153 -0.000053
C  -0.001785 1.26096 0.93904
C  -0.002079 -1.260944 -0.9391
C  -2.230856 0.920649 -1.274067
C  -2.231177 -0.920026 1.273913
C  0.732005 2.197586 0.010358
C  0.731355 -2.197837 -0.01041
C  2.05682 2.140496 -0.29223
C  2.056147 -2.141119 0.292351
H  -0.648746 1.831021 1.636758
H  0.711992 0.675641 1.550042
H  -0.649139 -1.830772 -1.636918
H  0.711925 -0.675791 -1.5500
H  -1.61181 1.421301 -2.041069
H  -2.909985 0.2189 -1.792862
H  -2.85424 1.691214 -0.783212
H  -2.910109 -0.218071 1.792686
H  -2.854779 -1.6904 0.783037
H  -1.612311 -1.420869 2.040939
H  0.11874 2.975871 -0.471725
H  0.117831 -2.976005 0.471533
H  2.515419 2.844814 -0.995437
H  2.717171 1.392292 0.164192
H  2.51447 -2.845615 0.995559
H  2.716751 -1.393048 -0.163924
