program: Orca
programVersion: 5.0.2
elementType: Cl P O O O O O N C C C C C C C C C C H H H H H H H H H H H H H H H H H H H
charge: 0
multiplicity: 1
keywords: wb97x-d3
keywords: def2-TZVPP
keywords: def2/J RIJCOSX
keywords: DEFGRID2
keywords: scfconv7
keywords: smallprint printgap noloewdin
keywords: NOSOSCF
formula: C10H19ClNO5P
InChI: InChI=1/C10H19ClNO5P/c1-6-12(7-2)10(13)9(11)8(3)17-18(14,15-4)16-5/h6-7H2,1-5H3
37 atoms
Cl -0.8230 -2.024007 1.088098
P  2.50539 -0.49975 0.117352
O  1.434091 -0.211931 1.285648
O  -2.870958 0.568671 1.855291
O  1.559331 -0.904213 -1.08368
O  3.076168 0.899893 -0.37058
O  3.508373 -1.467709 0.600531
N  -2.736518 0.37458 -0.398229
C  -4.085396 0.895416 -0.591158
C  -2.012651 -0.034798 -1.597826
C  -2.250982 0.262721 0.840303
C  -5.154579 -0.17483 -0.46546
C  -1.271375 1.103158 -2.272863
C  -0.867203 -0.301081 0.967084
C  0.233974 0.4333 1.071932
C  0.286018 1.918787 1.046117
C  2.041703 -1.01444 -2.433142
C  4.114014 1.572243 0.356767
H  -4.265437 1.701883 0.118538
H  -4.120292 1.345274 -1.583343
H  -1.324129 -0.8439 -1.36356
H  -2.745824 -0.463235 -2.283086
H  -5.169925 -0.610909 0.533053
H  -6.136373 0.258996 -0.655871
H  -4.999436 -0.977877 -1.18694
H  -0.790399 0.741861 -3.182181
H  -1.947715 1.911799 -2.552662
H  -0.498582 1.516282 -1.625485
H  -0.706222 2.362592 1.023635
H  0.798088 2.285112 1.937193
H  0.834177 2.28375 0.176782
H  2.266427 -0.031692 -2.845373
H  1.244566 -1.472378 -3.011103
H  2.928297 -1.646508 -2.485858
H  4.321165 2.495542 -0.178346
H  5.020166 0.968858 0.393217
H  3.790933 1.813272 1.369842
elementType: Cl P O N C H
totalener: -1625.17345279 hartree
nucrepener: 1853.54616299 hartree
electener: -3478.71961578 hartree
oneelecener: -5919.68347203 hartree
twoeener: 2440.96385625 hartree
cpcmener: -0.05164640 hartree
kineticenergy: 1620.10288115 hartree
xcener: -115.232438016808 hartree
chargesum: -0.0000000
charge: -0.081152 0.919473 -0.356758 -0.556632 -0.319559 -0.341005 -0.637628 -0.081432 -0.032602 -0.043626 0.322576 -0.252414 -0.281123 -0.005806 0.176769 -0.257500 -0.126508 -0.114195 0.087316 0.099418 0.089464 0.109908 0.084207 0.097810 0.085014 0.101391 0.100506 0.090359 0.110398 0.128341 0.111340 0.128088 0.125256 0.138176 0.129637 0.126391 0.126102
qa: -0.0812 0.9195 -0.3568 -0.5566 -0.3196 -0.3410 -0.6376 -0.0814 -0.0326 -0.0436 0.3226 -0.2524 -0.2811 -0.0058 0.1768 -0.2575 -0.1265 -0.1142 0.0873 0.0994 0.0895 0.1099 0.0842 0.0978 0.0850 0.1014 0.1005 0.0904 0.1104 0.1283 0.1113 0.1281 0.1253 0.1382 0.1296 0.1264 0.1261
va: 1.2430 5.5970 2.1136 1.9301 2.0910 2.0645 1.9803 3.1847 3.8698 3.9053 4.1475 3.9168 3.9129 3.9540 3.8064 3.9756 3.8250 3.8243 1.0152 0.9988 1.0132 0.9964 1.0104 1.0060 1.0043 1.0060 1.0085 0.9944 1.0131 1.0015 0.9969 0.9903 0.9868 0.9924 0.9891 0.9987 0.9852
dispcorr: -0.021087244 hartree
energy: -1625.194540033082
dipole: -11.74050 11.82780 0.08730 17.51845 -15.10452 2.41393 -18.83777 15.08919 -3.74859
magnitude: 4.45944 au
magnitude: 11.33498 debye
