program: Orca
programVersion: 5.0.2
elementType: Cl P O O O O O N C C C C C C C C C C H H H H H H H H H H H H H H H H H H H
charge: 0
multiplicity: 1
keywords: wb97x-d3
keywords: def2-TZVPP
keywords: def2/J RIJCOSX
keywords: DEFGRID2
keywords: scfconv7
keywords: smallprint printgap noloewdin
keywords: NOSOSCF
formula: C10H19ClNO5P
InChI: InChI=1/C10H19ClNO5P/c1-6-12(7-2)10(13)9(11)8(3)17-18(14,15-4)16-5/h6-7H2,1-5H3
37 atoms
Cl -0.868787 0.748083 -2.135504
P  2.512643 0.07541 -0.487076
O  1.398552 1.235387 -0.396484
O  -2.909608 1.822292 0.371626
O  3.099474 -0.131579 0.975421
O  1.615063 -1.212084 -0.677455
O  3.504139 0.414645 -1.524468
N  -2.711814 -0.432252 0.480666
C  -4.043855 -0.590375 1.053752
C  -1.970823 -1.657394 0.194785
C  -2.267031 0.79216 0.188551
C  -5.133378 -0.655722 -0.000725
C  -1.186655 -2.184399 1.380772
C  -0.895726 0.873304 -0.412574
C  0.209023 1.100809 0.287834
C  0.269555 1.294493 1.76088
C  4.069109 0.789242 1.499241
C  2.188721 -2.527697 -0.742027
H  -4.035741 -1.507401 1.643132
H  -4.234824 0.22248 1.753084
H  -2.699017 -2.401051 -0.132232
H  -1.308304 -1.505209 -0.654057
H  -6.10047 -0.819706 0.475027
H  -5.194725 0.270463 -0.57175
H  -4.961511 -1.476742 -0.697819
H  -0.432988 -1.471051 1.712343
H  -1.838689 -2.406217 2.226273
H  -0.677286 -3.107236 1.10228
H  0.781258 2.230982 1.988939
H  -0.721153 1.338567 2.206228
H  0.818849 0.489222 2.249567
H  3.671979 1.804256 1.531833
H  4.983092 0.772524 0.906848
H  4.292458 0.464629 2.511789
H  1.404647 -3.191456 -1.094231
H  2.520923 -2.850183 0.243314
H  3.023801 -2.560465 -1.441255
elementType: Cl P O N C H
totalener: -1625.17354009 hartree
nucrepener: 1852.03539953 hartree
electener: -3477.20893961 hartree
oneelecener: -5916.66690833 hartree
twoeener: 2439.45796872 hartree
cpcmener: -0.05072483 hartree
kineticenergy: 1620.11034143 hartree
xcener: -115.233539036072 hartree
chargesum: 0.0000000
charge: -0.080495 0.922626 -0.357204 -0.556063 -0.343350 -0.317458 -0.638086 -0.082563 -0.033189 -0.044714 0.320168 -0.252211 -0.278845 -0.001162 0.174953 -0.259820 -0.115193 -0.124427 0.099690 0.087560 0.109941 0.091193 0.097862 0.084139 0.084778 0.087445 0.099682 0.101311 0.128436 0.111758 0.112578 0.125260 0.126871 0.130609 0.125017 0.129984 0.132920
qa: -0.0805 0.9226 -0.3572 -0.5561 -0.3433 -0.3175 -0.6381 -0.0826 -0.0332 -0.0447 0.3202 -0.2522 -0.2788 -0.0012 0.1750 -0.2598 -0.1152 -0.1244 0.0997 0.0876 0.1099 0.0912 0.0979 0.0841 0.0848 0.0874 0.0997 0.1013 0.1284 0.1118 0.1126 0.1253 0.1269 0.1306 0.1250 0.1300 0.1329
va: 1.2436 5.5991 2.1138 1.9303 2.0638 2.0955 1.9808 3.1854 3.8702 3.9033 4.1497 3.9155 3.9121 3.9541 3.8056 3.9738 3.8243 3.8237 0.9988 1.0156 0.9965 1.0146 1.0059 1.0102 1.0047 0.9967 1.0086 1.0060 1.0011 1.0139 0.9966 0.9856 0.9988 0.9891 0.9867 0.9901 0.9946
dispcorr: -0.021013295 hartree
energy: -1625.194553381290
dipole: -11.05784 11.25017 0.19233 -16.18359 12.92164 -3.26195 19.58705 -16.81838 2.76867
magnitude: 4.28285 au
magnitude: 10.88615 debye
