program: Orca
programVersion: 5.0.2
elementType: Cl P O O O O O N C C C C C C C C C C H H H H H H H H H H H H H H H H H H H
charge: 0
multiplicity: 1
keywords: wb97x-d3
keywords: def2-TZVPP
keywords: def2/J RIJCOSX
keywords: DEFGRID2
keywords: scfconv7
keywords: smallprint printgap noloewdin
keywords: NOSOSCF
formula: C10H19ClNO5P
InChI: InChI=1/C10H19ClNO5P/c1-6-12(7-2)10(13)9(11)8(3)17-18(14,15-4)16-5/h6-7H2,1-5H3
37 atoms
Cl -0.14015 -1.473968 1.03096
P  2.762435 0.517078 -0.302592
O  1.447516 -0.116404 -1.011404
O  -1.979444 1.504931 1.091425
O  2.424281 0.574692 1.24409
O  3.787359 -0.669191 -0.451346
O  3.234882 1.776018 -0.90872
N  -3.042078 -0.195694 0.042041
C  -4.354713 0.353104 0.366941
C  -3.022033 -1.358355 -0.837282
C  -1.951391 0.466833 0.433594
C  -4.800659 1.42252 -0.614879
C  -3.411794 -2.650615 -0.143351
C  -0.616807 -0.116779 0.075802
C  0.19809 0.431071 -0.820203
C  -0.143863 1.574027 -1.707088
C  1.918003 1.745698 1.902339
C  3.555535 -1.99445 0.05346
H  -5.065306 -0.472879 0.365518
H  -4.3412 0.743591 1.383623
H  -3.709405 -1.159404 -1.662486
H  -2.036419 -1.454336 -1.288442
H  -4.838829 1.034306 -1.633297
H  -5.800734 1.769623 -0.354601
H  -4.134011 2.284506 -0.602691
H  -3.387899 -3.468238 -0.86383
H  -2.725106 -2.895083 0.665818
H  -4.421128 -2.606226 0.266523
H  0.011797 1.290104 -2.74897
H  -1.178288 1.88997 -1.598464
H  0.495891 2.433964 -1.501087
H  2.193427 1.660798 2.949948
H  0.833137 1.789693 1.816578
H  2.352225 2.656395 1.492941
H  4.471843 -2.551304 -0.119243
H  2.738478 -2.476995 -0.479963
H  3.344503 -1.981315 1.121486
elementType: Cl P O N C H
totalener: -1625.17144383 hartree
nucrepener: 1839.89695175 hartree
electener: -3465.06839558 hartree
oneelecener: -5892.54253649 hartree
twoeener: 2427.47414092 hartree
cpcmener: -0.04248046 hartree
kineticenergy: 1620.10335174 hartree
xcener: -115.235023528405 hartree
chargesum: -0.0000000
charge: -0.080478 0.932830 -0.356717 -0.553875 -0.332180 -0.348465 -0.641231 -0.079554 -0.031792 -0.062738 0.317925 -0.258212 -0.235242 -0.013498 0.179224 -0.218517 -0.094030 -0.108200 0.101161 0.087981 0.105018 0.113057 0.086172 0.099610 0.084737 0.095068 0.072850 0.087935 0.117192 0.096131 0.104554 0.131321 0.109866 0.117824 0.134646 0.117374 0.122252
qa: -0.0805 0.9328 -0.3567 -0.5539 -0.3322 -0.3485 -0.6412 -0.0796 -0.0318 -0.0627 0.3179 -0.2582 -0.2352 -0.0135 0.1792 -0.2185 -0.0940 -0.1082 0.1012 0.0880 0.1050 0.1131 0.0862 0.0996 0.0847 0.0951 0.0729 0.0879 0.1172 0.0961 0.1046 0.1313 0.1099 0.1178 0.1346 0.1174 0.1223
va: 1.2405 5.6031 2.0814 1.9235 2.0691 2.1259 1.9724 3.2368 3.8673 3.9139 4.1371 3.9181 3.9039 3.9613 3.7621 3.9974 3.8090 3.8196 0.9996 1.0155 0.9948 0.9917 1.0034 1.0059 1.0100 1.0071 1.0172 1.0052 1.0016 1.0127 1.0097 0.9895 1.0013 1.0038 0.9923 0.9959 0.9918
dispcorr: -0.020256403 hartree
energy: -1625.191700233311
dipole: -25.98810 23.59068 -2.39743 -0.22911 -2.06153 -2.29064 -4.19592 3.91067 -0.28525
magnitude: 3.32807 au
magnitude: 8.45929 debye
