program: Orca
programVersion: 5.0.2
elementType: Cl P O O O O O N C C C C C C C C C C H H H H H H H H H H H H H H H H H H H
charge: 0
multiplicity: 1
keywords: wb97x-d3
keywords: def2-TZVPP
keywords: def2/J RIJCOSX
keywords: DEFGRID2
keywords: scfconv7
keywords: smallprint printgap noloewdin
keywords: NOSOSCF
formula: C10H19ClNO5P
InChI: InChI=1/C10H19ClNO5P/c1-6-12(7-2)10(13)9(11)8(3)17-18(14,15-4)16-5/h6-7H2,1-5H3
37 atoms
Cl -0.793523 0.875743 -2.071011
P  2.573178 0.315125 -0.294675
O  1.374196 1.389662 -0.222221
O  -2.959723 1.792659 0.369666
O  3.269801 0.554742 1.108164
O  1.896309 -1.111332 -0.126083
O  3.390873 0.517639 -1.50604
N  -2.735599 -0.461685 0.399389
C  -4.099849 -0.660331 0.876713
C  -1.960149 -1.666429 0.121597
C  -2.293013 0.778659 0.182329
C  -5.111522 -0.728762 -0.252734
C  -1.27554 -2.238907 1.346878
C  -0.895177 0.91334 -0.345461
C  0.171251 1.155871 0.408137
C  0.169845 1.255483 1.891049
C  4.394109 -0.24493 1.510417
C  1.666664 -1.980048 -1.247377
H  -4.112446 -1.588783 1.447902
H  -4.35725 0.134047 1.57539
H  -2.6486 -2.400338 -0.300322
H  -1.229408 -1.468017 -0.659344
H  -5.147894 0.203492 -0.816037
H  -4.877139 -1.53783 -0.945694
H  -6.106679 -0.914582 0.15162
H  -1.992584 -2.465803 2.136802
H  -0.767845 -3.167597 1.085032
H  -0.533599 -1.549412 1.749245
H  0.731721 0.437737 2.345141
H  0.635961 2.1917 2.201573
H  -0.837463 1.23163 2.299283
H  5.206875 -0.172036 0.788578
H  4.105643 -1.288166 1.633574
H  4.728818 0.147859 2.466079
H  1.210322 -2.881593 -0.848805
H  2.604685 -2.239518 -1.735361
H  0.992045 -1.52804 -1.972365
elementType: Cl P O N C H
totalener: -1625.17321282 hartree
nucrepener: 1850.81827454 hartree
electener: -3475.99148737 hartree
oneelecener: -5913.97663765 hartree
twoeener: 2437.98515029 hartree
cpcmener: -0.05044608 hartree
kineticenergy: 1620.10049349 hartree
xcener: -115.231707097958 hartree
chargesum: 0.0000000
charge: -0.076924 0.922101 -0.353959 -0.555527 -0.336381 -0.336272 -0.634728 -0.083971 -0.033083 -0.035006 0.326221 -0.252710 -0.273001 -0.014990 0.161171 -0.234687 -0.112800 -0.123042 0.100462 0.087550 0.109029 0.085962 0.084757 0.085055 0.098082 0.097551 0.102532 0.087330 0.105686 0.127615 0.106838 0.122210 0.125421 0.129259 0.129069 0.141738 0.121441
qa: -0.0769 0.9221 -0.3540 -0.5555 -0.3364 -0.3363 -0.6347 -0.0840 -0.0331 -0.0350 0.3262 -0.2527 -0.2730 -0.0150 0.1612 -0.2347 -0.1128 -0.1230 0.1005 0.0875 0.1090 0.0860 0.0848 0.0851 0.0981 0.0976 0.1025 0.0873 0.1057 0.1276 0.1068 0.1222 0.1254 0.1293 0.1291 0.1417 0.1214
va: 1.2489 5.5889 2.1153 1.9321 2.0998 2.0349 1.9758 3.1924 3.8690 3.9098 4.1424 3.9176 3.9104 3.9508 3.8005 3.9686 3.8286 3.8112 0.9988 1.0167 0.9983 0.9984 1.0093 1.0046 1.0059 1.0092 1.0056 0.9967 1.0002 1.0042 1.0131 0.9931 0.9914 0.9893 0.9872 1.0009 0.9931
dispcorr: -0.021283521 hartree
energy: -1625.194496344680
dipole: -12.84730 12.79570 -0.05160 -20.38858 16.39935 -3.98922 15.71658 -13.59470 2.12188
magnitude: 4.51873 au
magnitude: 11.48570 debye
