program: Orca
programVersion: 5.0.2
elementType: Cl P O O O O O N C C C C C C C C C C H H H H H H H H H H H H H H H H H H H
charge: 0
multiplicity: 1
keywords: wb97x-d3
keywords: def2-TZVPP
keywords: def2/J RIJCOSX
keywords: DEFGRID2
keywords: scfconv7
keywords: smallprint printgap noloewdin
keywords: NOSOSCF
formula: C10H19ClNO5P
InChI: InChI=1/C10H19ClNO5P/c1-6-12(7-2)10(13)9(11)8(3)17-18(14,15-4)16-5/h6-7H2,1-5H3
37 atoms
Cl -0.281487 -1.37668 1.528654
P  2.294213 -0.230602 -0.510193
O  1.544727 0.706671 0.580851
O  -2.702429 0.966791 1.82597
O  3.584046 0.614632 -0.875776
O  2.89253 -1.445806 0.29485
O  1.408871 -0.648218 -1.615189
N  -2.871432 0.003311 -0.218001
C  -4.319242 0.180117 -0.261456
C  -2.264185 -0.673357 -1.359895
C  -2.19159 0.418469 0.853239
C  -5.067311 -0.977053 0.376279
C  -1.930494 0.263423 -2.504673
C  -0.714359 0.155262 0.853879
C  0.209766 1.024424 0.462586
C  -0.046913 2.38155 -0.082458
C  3.470256 1.862295 -1.580378
C  3.651108 -1.297236 1.505845
H  -4.584177 1.120751 0.218922
H  -4.603255 0.278481 -1.309464
H  -1.374168 -1.215467 -1.047498
H  -2.97081 -1.434498 -1.693644
H  -4.831051 -1.071691 1.436177
H  -6.142098 -0.819389 0.28514
H  -4.827559 -1.922054 -0.113356
H  -1.17873 0.996849 -2.216426
H  -1.536441 -0.308154 -3.345096
H  -2.813207 0.801233 -2.85291
H  0.351528 2.466997 -1.095454
H  -1.105709 2.626295 -0.11132
H  0.455607 3.129709 0.533368
H  4.479889 2.162986 -1.845563
H  3.024581 2.627066 -0.944715
H  2.881893 1.750136 -2.490782
H  4.578946 -0.757014 1.322667
H  3.884286 -2.301768 1.847428
H  3.07093 -0.785346 2.272469
elementType: Cl P O N C H
totalener: -1625.17418555 hartree
nucrepener: 1852.56914479 hartree
electener: -3477.74333034 hartree
oneelecener: -5918.61397193 hartree
twoeener: 2440.87064159 hartree
cpcmener: -0.04641916 hartree
kineticenergy: 1620.09945413 hartree
xcener: -115.232804444508 hartree
chargesum: -0.0000000
charge: -0.080187 0.928635 -0.369992 -0.557025 -0.337879 -0.345681 -0.624539 -0.083406 -0.033657 -0.044696 0.333569 -0.253527 -0.274344 -0.012092 0.199295 -0.267197 -0.124255 -0.104926 0.087644 0.100612 0.088372 0.108978 0.085196 0.097932 0.084950 0.085617 0.103772 0.095318 0.112318 0.111393 0.128086 0.135903 0.127424 0.124959 0.127753 0.130098 0.115577
qa: -0.0802 0.9286 -0.3700 -0.5570 -0.3379 -0.3457 -0.6245 -0.0834 -0.0337 -0.0447 0.3336 -0.2535 -0.2743 -0.0121 0.1993 -0.2672 -0.1243 -0.1049 0.0876 0.1006 0.0884 0.1090 0.0852 0.0979 0.0850 0.0856 0.1038 0.0953 0.1123 0.1114 0.1281 0.1359 0.1274 0.1250 0.1278 0.1301 0.1156
va: 1.2504 5.5871 2.0552 1.9305 2.1007 2.1089 1.9629 3.1811 3.8687 3.8948 4.1264 3.9190 3.9169 3.9719 3.7538 3.9876 3.8364 3.8197 1.0169 0.9982 1.0205 0.9973 1.0087 1.0058 1.0045 0.9977 1.0065 1.0079 0.9907 1.0136 1.0010 0.9904 0.9841 0.9902 0.9944 0.9881 0.9971
dispcorr: -0.020568127 hartree
energy: -1625.194753680483
dipole: -14.25074 15.25027 0.99952 9.22503 -7.98902 1.23600 -12.40019 11.12523 -1.27495
magnitude: 2.03771 au
magnitude: 5.17945 debye
