program: Orca
programVersion: 5.0.2
elementType: Cl P O O O O O N C C C C C C C C C C H H H H H H H H H H H H H H H H H H H
charge: 0
multiplicity: 1
keywords: wb97x-d3
keywords: def2-TZVPP
keywords: def2/J RIJCOSX
keywords: DEFGRID2
keywords: scfconv7
keywords: smallprint printgap noloewdin
keywords: NOSOSCF
formula: C10H19ClNO5P
InChI: InChI=1/C10H19ClNO5P/c1-6-12(7-2)10(13)9(11)8(3)17-18(14,15-4)16-5/h6-7H2,1-5H3
37 atoms
Cl -0.354995 -1.085285 1.846823
P  2.645206 0.650173 -0.517962
O  1.430799 0.731831 0.55317
O  -2.791674 1.365472 1.289343
O  3.704467 -0.18571 0.306451
O  2.167013 -0.335115 -1.653446
O  3.073821 1.95851 -1.047524
N  -2.971351 -0.436128 -0.067732
C  -4.420882 -0.292085 -0.152552
C  -2.365973 -1.44377 -0.93171
C  -2.279157 0.43238 0.676091
C  -4.860556 0.712007 -1.202804
C  -2.551117 -2.867324 -0.438358
C  -0.801356 0.208705 0.788845
C  0.122688 0.986967 0.230906
C  -0.163006 2.115307 -0.695929
C  4.439978 0.405598 1.39111
C  1.833421 -1.716364 -1.441442
H  -4.833613 -1.273925 -0.382963
H  -4.810809 -0.018317 0.826961
H  -2.813656 -1.335772 -1.922178
H  -1.307304 -1.2228 -1.059439
H  -4.504783 1.716472 -0.975331
H  -4.496956 0.436465 -2.193321
H  -5.949368 0.744618 -1.24621
H  -2.078687 -3.023271 0.530117
H  -3.604313 -3.135468 -0.350906
H  -2.096814 -3.557448 -1.149404
H  -1.228106 2.321231 -0.759803
H  0.336773 3.023789 -0.359205
H  0.184829 1.893698 -1.706694
H  5.238846 -0.286479 1.640157
H  3.796896 0.542553 2.259374
H  4.873113 1.361892 1.100131
H  2.739872 -2.315458 -1.375586
H  1.255523 -2.031597 -2.305598
H  1.236381 -1.861492 -0.541628
elementType: Cl P O N C H
totalener: -1625.17243021 hartree
nucrepener: 1825.14013606 hartree
electener: -3450.31256627 hartree
oneelecener: -5862.49195890 hartree
twoeener: 2412.17939263 hartree
cpcmener: -0.04715405 hartree
kineticenergy: 1620.09157877 hartree
xcener: -115.232732987715 hartree
chargesum: 0.0000000
charge: -0.089536 0.930728 -0.331391 -0.554632 -0.339864 -0.346447 -0.631913 -0.085809 -0.035932 -0.049060 0.314836 -0.254850 -0.242840 0.006091 0.152317 -0.233048 -0.110013 -0.114106 0.102017 0.087976 0.105576 0.094876 0.083972 0.085210 0.098047 0.075512 0.089697 0.096158 0.099358 0.122856 0.112172 0.129511 0.127831 0.116986 0.139873 0.132697 0.115148
qa: -0.0895 0.9307 -0.3314 -0.5546 -0.3399 -0.3464 -0.6319 -0.0858 -0.0359 -0.0491 0.3148 -0.2548 -0.2428 0.0061 0.1523 -0.2330 -0.1100 -0.1141 0.1020 0.0880 0.1056 0.0949 0.0840 0.0852 0.0980 0.0755 0.0897 0.0962 0.0994 0.1229 0.1122 0.1295 0.1278 0.1170 0.1399 0.1327 0.1151
va: 1.2303 5.5900 2.1043 1.9288 2.1064 2.0853 1.9770 3.1969 3.8719 3.9225 4.1682 3.9165 3.8983 3.8895 3.8321 3.9404 3.8291 3.8098 0.9992 1.0152 0.9969 0.9880 1.0114 1.0037 1.0058 1.0185 1.0062 1.0071 1.0200 1.0047 1.0058 0.9881 0.9900 0.9953 0.9944 0.9898 0.9950
dispcorr: -0.020008736 hartree
energy: -1625.192438940917
dipole: -18.64211 18.15355 -0.48856 -6.93987 3.96586 -2.97401 -11.81204 10.73450 -1.07754
magnitude: 3.20070 au
magnitude: 8.13554 debye
