program: Orca
programVersion: 5.0.2
elementType: Cl P O O O O O N C C C C C C C C C C H H H H H H H H H H H H H H H H H H H
charge: 0
multiplicity: 1
keywords: wb97x-d3
keywords: def2-TZVPP
keywords: def2/J RIJCOSX
keywords: DEFGRID2
keywords: scfconv7
keywords: smallprint printgap noloewdin
keywords: NOSOSCF
formula: C10H19ClNO5P
InChI: InChI=1/C10H19ClNO5P/c1-6-12(7-2)10(13)9(11)8(3)17-18(14,15-4)16-5/h6-7H2,1-5H3
37 atoms
Cl -0.416488 -1.175669 1.767795
P  2.791219 0.787552 -0.455657
O  1.433474 0.422276 0.345588
O  -2.657407 1.507094 1.088682
O  3.822147 -0.085317 0.365855
O  2.70287 0.057155 -1.852628
O  3.067521 2.228838 -0.591147
N  -3.078382 -0.4344 0.006524
C  -4.507214 -0.147255 -0.055004
C  -2.618767 -1.594911 -0.747273
C  -2.266166 0.452898 0.592394
C  -4.887332 0.725823 -1.238068
C  -2.944752 -2.923073 -0.087734
C  -0.811373 0.106199 0.67186
C  0.151926 0.789429 0.055081
C  -0.085623 1.901891 -0.904833
C  4.209308 0.280657 1.699271
C  2.482538 -1.356453 -1.984653
H  -5.031414 -1.100716 -0.115448
H  -4.820752 0.3152 0.879641
H  -3.083582 -1.551614 -1.735028
H  -1.547519 -1.510871 -0.921355
H  -4.42224 1.709651 -1.179109
H  -4.595601 0.265233 -2.182708
H  -5.968049 0.867306 -1.259495
H  -2.481471 -3.010165 0.893643
H  -4.018903 -3.069406 0.02792
H  -2.57076 -3.736125 -0.710088
H  -1.146134 2.054559 -1.082608
H  0.331323 2.836835 -0.53025
H  0.371969 1.690158 -1.872613
H  3.3900 0.113051 2.397813
H  4.525294 1.322362 1.747316
H  5.045935 -0.357691 1.968763
H  1.665086 -1.699406 -1.35018
H  3.390234 -1.907303 -1.743147
H  2.22195 -1.533453 -3.024187
elementType: Cl P O N C H
totalener: -1625.17277773 hartree
nucrepener: 1803.31969887 hartree
electener: -3428.49247660 hartree
oneelecener: -5819.06719906 hartree
twoeener: 2390.57472246 hartree
cpcmener: -0.04699255 hartree
kineticenergy: 1620.09874274 hartree
xcener: -115.235113413386 hartree
chargesum: 0.0000000
charge: -0.095172 0.920583 -0.308118 -0.555468 -0.342671 -0.346112 -0.629960 -0.088223 -0.034189 -0.063022 0.309592 -0.255345 -0.237681 -0.004526 0.175756 -0.244710 -0.103611 -0.099121 0.101240 0.087278 0.103388 0.107324 0.083576 0.085431 0.097844 0.074540 0.088091 0.095510 0.099195 0.122357 0.115726 0.122431 0.116756 0.128911 0.114735 0.127817 0.129846
qa: -0.0952 0.9206 -0.3081 -0.5555 -0.3427 -0.3461 -0.6300 -0.0882 -0.0342 -0.0630 0.3096 -0.2553 -0.2377 -0.0045 0.1758 -0.2447 -0.1036 -0.0991 0.1012 0.0873 0.1034 0.1073 0.0836 0.0854 0.0978 0.0745 0.0881 0.0955 0.0992 0.1224 0.1157 0.1224 0.1168 0.1289 0.1147 0.1278 0.1298
va: 1.2263 5.6079 2.1219 1.9262 2.1088 2.0934 1.9790 3.1879 3.8715 3.9197 4.1842 3.9162 3.8980 3.8705 3.8123 3.9462 3.8287 3.8187 0.9990 1.0165 0.9960 0.9916 1.0110 1.0035 1.0062 1.0185 1.0047 1.0070 1.0183 1.0060 1.0063 0.9936 0.9950 0.9886 0.9914 0.9933 0.9905
dispcorr: -0.018843383 hartree
energy: -1625.191621117616
dipole: -19.83800 19.24997 -0.58804 -7.54306 4.23463 -3.30843 -11.39486 10.05853 -1.33633
magnitude: 3.61625 au
magnitude: 9.19179 debye
