program: Orca
programVersion: 5.0.2
elementType: Cl P O O O O O N C C C C C C C C C C H H H H H H H H H H H H H H H H H H H
charge: 0
multiplicity: 1
keywords: wb97x-d3
keywords: def2-TZVPP
keywords: def2/J RIJCOSX
keywords: DEFGRID2
keywords: scfconv7
keywords: smallprint printgap noloewdin
keywords: NOSOSCF
formula: C10H19ClNO5P
InChI: InChI=1/C10H19ClNO5P/c1-6-12(7-2)10(13)9(11)8(3)17-18(14,15-4)16-5/h6-7H2,1-5H3
37 atoms
Cl -0.477136 -1.469052 1.594175
P  2.789763 0.848032 -0.060852
O  1.402386 0.014696 0.014862
O  -2.527118 1.355802 1.290623
O  3.797116 -0.234674 0.502808
O  3.178412 0.948052 -1.587867
O  2.747438 2.170513 0.589263
N  -3.15332 -0.36313 -0.040998
C  -4.548355 0.064223 -0.022789
C  -2.822161 -1.456955 -0.946623
C  -2.248685 0.359246 0.628035
C  -4.845435 1.149461 -1.043214
C  -3.252527 -2.821014 -0.440097
C  -0.824299 -0.106724 0.587767
C  0.136924 0.523701 -0.082526
C  -0.098035 1.680913 -0.989521
C  3.741163 -0.663574 1.873627
C  3.247269 -0.193174 -2.457325
H  -5.162932 -0.812596 -0.224373
H  -4.80984 0.396612 0.980863
H  -3.304087 -1.24947 -1.904659
H  -1.752355 -1.449872 -1.144658
H  -5.905319 1.402843 -1.014439
H  -4.278803 2.058585 -0.843052
H  -4.612022 0.816852 -2.055364
H  -2.760074 -3.074581 0.497823
H  -4.330396 -2.87984 -0.286928
H  -2.986263 -3.579623 -1.176139
H  -1.158466 1.851048 -1.157193
H  0.325417 2.600111 -0.583899
H  0.36002 1.497259 -1.962442
H  2.829942 -1.229238 2.064976
H  3.795238 0.185883 2.553338
H  4.602635 -1.305189 2.033845
H  2.349886 -0.807028 -2.386334
H  4.123873 -0.797628 -2.229698
H  3.331303 0.193424 -3.468849
elementType: Cl P O N C H
totalener: -1625.17346002 hartree
nucrepener: 1797.46672329 hartree
electener: -3422.64018331 hartree
oneelecener: -5807.65017333 hartree
twoeener: 2385.00999003 hartree
cpcmener: -0.04914744 hartree
kineticenergy: 1620.09076086 hartree
xcener: -115.232353685768 hartree
chargesum: 0.0000000
charge: -0.089725 0.930803 -0.324169 -0.552794 -0.343017 -0.350211 -0.629891 -0.086637 -0.031781 -0.068814 0.296030 -0.258963 -0.233594 0.005526 0.160081 -0.233782 -0.102626 -0.112639 0.099856 0.088164 0.105120 0.114426 0.100029 0.084100 0.086172 0.072768 0.087655 0.094743 0.102217 0.118961 0.123241 0.116048 0.120277 0.129841 0.123071 0.128583 0.130933
qa: -0.0897 0.9308 -0.3242 -0.5528 -0.3430 -0.3502 -0.6299 -0.0866 -0.0318 -0.0688 0.2960 -0.2590 -0.2336 0.0055 0.1601 -0.2338 -0.1026 -0.1126 0.0999 0.0882 0.1051 0.1144 0.1000 0.0841 0.0862 0.0728 0.0877 0.0947 0.1022 0.1190 0.1232 0.1160 0.1203 0.1298 0.1231 0.1286 0.1309
va: 1.2328 5.5965 2.0884 1.9249 2.1092 2.0949 1.9739 3.1831 3.8694 3.9178 4.1871 3.9160 3.9030 3.9011 3.8173 3.9395 3.8298 3.8226 0.9998 1.0156 0.9946 0.9899 1.0061 1.0110 1.0031 1.0172 1.0052 1.0073 1.0130 1.0124 1.0003 0.9967 0.9927 0.9898 0.9911 0.9937 0.9889
dispcorr: -0.018872458 hartree
energy: -1625.192332480639
dipole: -20.15527 19.55949 -0.59578 -5.22321 2.03916 -3.18405 -14.65847 11.92698 -2.73149
magnitude: 4.23723 au
magnitude: 10.77019 debye
