program: Orca
programVersion: 5.0.2
elementType: Cl P O O O O O N C C C C C C C C C C H H H H H H H H H H H H H H H H H H H
charge: 0
multiplicity: 1
keywords: wb97x-d3
keywords: def2-TZVPP
keywords: def2/J RIJCOSX
keywords: DEFGRID2
keywords: scfconv7
keywords: smallprint printgap noloewdin
keywords: NOSOSCF
formula: C10H19ClNO5P
InChI: InChI=1/C10H19ClNO5P/c1-6-12(7-2)10(13)9(11)8(3)17-18(14,15-4)16-5/h6-7H2,1-5H3
37 atoms
Cl -0.461039 -1.966908 0.84644
P  2.71131 0.695704 0.409417
O  1.403589 -0.03002 -0.216706
O  -2.426514 0.765971 1.681109
O  3.738249 -0.505375 0.444307
O  3.299206 1.635878 -0.715009
O  2.434937 1.428698 1.658444
N  -3.176271 -0.278718 -0.179408
C  -4.550116 0.142537 0.076513
C  -2.932795 -0.978492 -1.43391
C  -2.217738 0.102635 0.668531
C  -4.833756 1.55101 -0.415603
C  -3.386728 -2.4265 -1.414076
C  -0.81206 -0.339806 0.383154
C  0.135036 0.47507 -0.06996
C  -0.094537 1.87934 -0.507124
C  3.500417 -1.676331 1.244507
C  3.61981 1.165766 -2.03373
H  -5.209239 -0.564968 -0.425426
H  -4.762598 0.055879 1.141313
H  -3.45763 -0.433935 -2.221959
H  -1.874899 -0.91702 -1.682177
H  -4.221334 2.289995 0.100669
H  -4.64818 1.64116 -1.486511
H  -5.879854 1.801286 -0.238029
H  -3.203946 -2.877419 -2.389455
H  -2.844024 -3.005606 -0.668033
H  -4.453343 -2.517409 -1.206876
H  0.345877 2.042389 -1.491747
H  -1.15358 2.115853 -0.57654
H  0.356504 2.590945 0.186515
H  2.716474 -2.28957 0.803393
H  3.229609 -1.41136 2.266032
H  4.430159 -2.237419 1.25739
H  2.783432 0.629949 -2.481308
H  4.497948 0.522572 -2.011181
H  3.836548 2.046274 -2.631456
elementType: Cl P O N C H
totalener: -1625.17375115 hartree
nucrepener: 1803.35395228 hartree
electener: -3428.52770343 hartree
oneelecener: -5819.73642338 hartree
twoeener: 2391.20871995 hartree
cpcmener: -0.05106166 hartree
kineticenergy: 1620.10158625 hartree
xcener: -115.232444425582 hartree
chargesum: 0.0000000
charge: -0.084819 0.937383 -0.342601 -0.551730 -0.341596 -0.350246 -0.629369 -0.087021 -0.030809 -0.061140 0.303024 -0.260251 -0.236748 0.004353 0.149361 -0.222639 -0.111296 -0.112368 0.100992 0.087971 0.104871 0.112989 0.084647 0.086141 0.100447 0.095045 0.072912 0.087865 0.123812 0.102589 0.114214 0.118080 0.123781 0.132113 0.122490 0.127335 0.130221
qa: -0.0848 0.9374 -0.3426 -0.5517 -0.3416 -0.3502 -0.6294 -0.0870 -0.0308 -0.0611 0.3030 -0.2603 -0.2367 0.0044 0.1494 -0.2226 -0.1113 -0.1124 0.1010 0.0880 0.1049 0.1130 0.0846 0.0861 0.1004 0.0950 0.0729 0.0879 0.1238 0.1026 0.1142 0.1181 0.1238 0.1321 0.1225 0.1273 0.1302
va: 1.2386 5.5837 2.0714 1.9283 2.1095 2.0945 1.9712 3.1897 3.8655 3.9123 4.1713 3.9171 3.9053 3.9557 3.8026 3.9454 3.8296 3.8252 0.9995 1.0156 0.9945 0.9914 1.0108 1.0032 1.0060 1.0075 1.0167 1.0055 0.9990 1.0124 1.0125 0.9960 0.9906 0.9914 0.9912 0.9937 0.9893
dispcorr: -0.019114513 hartree
energy: -1625.192865665950
dipole: -19.98440 19.47474 -0.50966 1.63935 -3.34137 -1.70201 -15.92817 11.86056 -4.06761
magnitude: 4.43870 au
magnitude: 11.28229 debye
