program: Orca
programVersion: 5.0.2
elementType: Cl P O O O O O N C C C C C C C C C C H H H H H H H H H H H H H H H H H H H
charge: 0
multiplicity: 1
keywords: wb97x-d3
keywords: def2-TZVPP
keywords: def2/J RIJCOSX
keywords: DEFGRID2
keywords: scfconv7
keywords: smallprint printgap noloewdin
keywords: NOSOSCF
formula: C10H19ClNO5P
InChI: InChI=1/C10H19ClNO5P/c1-6-12(7-2)10(13)9(11)8(3)17-18(14,15-4)16-5/h6-7H2,1-5H3
37 atoms
Cl -0.485203 -0.314252 2.281185
P  2.587055 0.269431 -0.446567
O  1.409806 0.888031 0.468825
O  -2.902242 1.65804 0.900367
O  3.613334 -0.234708 0.648081
O  1.899752 -1.064437 -0.953057
O  3.128451 1.184918 -1.472377
N  -2.901138 -0.368711 -0.11265
C  -4.330179 -0.30309 -0.399856
C  -2.205591 -1.584906 -0.523909
C  -2.313803 0.646886 0.525066
C  -5.187727 -0.774691 0.760949
C  -1.730352 -1.554166 -1.963514
C  -0.846416 0.500267 0.799928
C  0.110177 1.019049 0.037733
C  -0.121937 1.783578 -1.217664
C  4.602153 0.645966 1.205555
C  2.42772 -1.791062 -2.075403
H  -4.595237 0.714326 -0.685057
H  -4.51202 -0.924795 -1.276447
H  -1.367402 -1.779589 0.141448
H  -2.898765 -2.414211 -0.375813
H  -4.941899 -1.798615 1.045216
H  -5.063498 -0.137657 1.6363
H  -6.240008 -0.751504 0.477007
H  -0.983107 -0.777274 -2.123558
H  -1.276683 -2.512029 -2.219591
H  -2.555327 -1.380859 -2.655421
H  -1.179936 1.960322 -1.392546
H  0.374339 2.753417 -1.162066
H  0.269171 1.257618 -2.09065
H  5.260171 0.027728 1.810295
H  4.135532 1.400856 1.838982
H  5.185918 1.13169 0.423903
H  3.403118 -2.21461 -1.838372
H  2.506859 -1.154354 -2.955491
H  1.72669 -2.595432 -2.278795
elementType: Cl P O N C H
totalener: -1625.17256312 hartree
nucrepener: 1825.46361661 hartree
electener: -3450.63617973 hartree
oneelecener: -5863.90967656 hartree
twoeener: 2413.27349683 hartree
cpcmener: -0.04588118 hartree
kineticenergy: 1620.08997366 hartree
xcener: -115.229252831236 hartree
chargesum: 0.0000000
charge: -0.083867 0.960550 -0.346041 -0.557407 -0.354933 -0.332609 -0.637325 -0.084332 -0.031411 -0.045322 0.315569 -0.252532 -0.270619 0.010269 0.138267 -0.243196 -0.114343 -0.118747 0.086847 0.099100 0.097350 0.108131 0.084906 0.084190 0.097785 0.082313 0.101205 0.096234 0.108739 0.132513 0.107906 0.129091 0.128453 0.117041 0.137008 0.122910 0.126305
qa: -0.0839 0.9606 -0.3460 -0.5574 -0.3549 -0.3326 -0.6373 -0.0843 -0.0314 -0.0453 0.3156 -0.2525 -0.2706 0.0103 0.1383 -0.2432 -0.1143 -0.1187 0.0868 0.0991 0.0974 0.1081 0.0849 0.0842 0.0978 0.0823 0.1012 0.0962 0.1087 0.1325 0.1079 0.1291 0.1285 0.1170 0.1370 0.1229 0.1263
va: 1.2380 5.5731 2.1257 1.9269 2.1118 2.0872 1.9476 3.1860 3.8706 3.9062 4.1575 3.9159 3.9154 3.9199 3.8233 3.9442 3.8366 3.8243 1.0152 0.9987 1.0116 0.9954 1.0043 1.0106 1.0056 0.9960 1.0064 1.0075 1.0140 1.0045 0.9999 0.9888 0.9865 0.9955 0.9891 0.9938 0.9878
dispcorr: -0.019777928 hartree
energy: -1625.192341044527
dipole: -13.98181 14.30220 0.32039 -8.65812 6.01097 -2.64715 -16.07424 14.48969 -1.58455
magnitude: 3.10175 au
magnitude: 7.88402 debye
