program: Orca
programVersion: 5.0.2
elementType: Cl P O O O O O N C C C C C C C C C C H H H H H H H H H H H H H H H H H H H
charge: 0
multiplicity: 1
keywords: wb97x-d3
keywords: def2-TZVPP
keywords: def2/J RIJCOSX
keywords: DEFGRID2
keywords: scfconv7
keywords: smallprint printgap noloewdin
keywords: NOSOSCF
formula: C10H19ClNO5P
InChI: InChI=1/C10H19ClNO5P/c1-6-12(7-2)10(13)9(11)8(3)17-18(14,15-4)16-5/h6-7H2,1-5H3
37 atoms
Cl -0.333997 1.943268 -0.901842
P  2.291344 -0.216852 -0.225422
O  1.474314 0.544154 0.944785
O  -2.826003 1.512123 1.370507
O  3.007105 1.01591 -0.907095
O  3.496776 -0.913234 0.537685
O  1.456879 -1.099098 -1.067907
N  -2.878826 -0.195714 -0.118599
C  -4.318931 -0.377357 0.027975
C  -2.208531 -1.060139 -1.084541
C  -2.259963 0.750868 0.590861
C  -5.122178 0.519623 -0.89658
C  -1.823375 -2.412878 -0.518803
C  -0.779028 0.878372 0.384789
C  0.133078 0.306874 1.16223
C  -0.152258 -0.573932 2.323598
C  3.704119 0.8611 -2.1547
C  3.276536 -2.100067 1.315493
H  -4.536438 -1.424378 -0.183547
H  -4.599714 -0.209134 1.066813
H  -2.890538 -1.186292 -1.926842
H  -1.331313 -0.561492 -1.490192
H  -4.86251 0.345626 -1.941483
H  -6.186405 0.314171 -0.779867
H  -4.957943 1.573713 -0.674166
H  -1.095437 -2.318689 0.286488
H  -2.691463 -2.947772 -0.132324
H  -1.379888 -3.0260 -1.303324
H  0.261128 -1.570823 2.157674
H  0.315993 -0.16877 3.222312
H  -1.216953 -0.675919 2.517482
H  3.027649 0.524406 -2.938678
H  4.534828 0.162992 -2.057869
H  4.091583 1.842444 -2.412472
H  2.787378 -2.875652 0.727509
H  2.678436 -1.877684 2.199268
H  4.254757 -2.453146 1.628955
elementType: Cl P O N C H
totalener: -1625.17301155 hartree
nucrepener: 1847.93389366 hartree
electener: -3473.10690521 hartree
oneelecener: -5909.51555700 hartree
twoeener: 2436.40865179 hartree
cpcmener: -0.04579272 hartree
kineticenergy: 1620.10369356 hartree
xcener: -115.232274767977 hartree
chargesum: -0.0000000
charge: -0.080627 0.952579 -0.369018 -0.556800 -0.344753 -0.346844 -0.622843 -0.081819 -0.033908 -0.043657 0.331014 -0.253093 -0.273955 0.002922 0.182152 -0.264846 -0.116971 -0.125286 0.100396 0.087885 0.109503 0.086732 0.085043 0.097806 0.084596 0.084672 0.094829 0.103683 0.111739 0.127219 0.109666 0.121409 0.126835 0.129982 0.122852 0.127165 0.133740
qa: -0.0806 0.9526 -0.3690 -0.5568 -0.3448 -0.3468 -0.6228 -0.0818 -0.0339 -0.0437 0.3310 -0.2531 -0.2740 0.0029 0.1822 -0.2648 -0.1170 -0.1253 0.1004 0.0879 0.1095 0.0867 0.0850 0.0978 0.0846 0.0847 0.0948 0.1037 0.1117 0.1272 0.1097 0.1214 0.1268 0.1300 0.1229 0.1272 0.1337
va: 1.2471 5.5737 2.0991 1.9301 2.1058 2.1030 1.9368 3.1838 3.8697 3.8927 4.1306 3.9166 3.9148 3.9455 3.7983 3.9821 3.8348 3.8426 0.9986 1.0158 0.9978 1.0229 1.0045 1.0056 1.0096 0.9986 1.0082 1.0066 0.9910 1.0010 1.0140 0.9933 0.9897 0.9884 0.9918 0.9811 0.9905
dispcorr: -0.020144762 hartree
energy: -1625.193156310281
dipole: -14.24805 15.15450 0.90646 -19.01879 16.40538 -2.61341 0.28971 -0.64649 -0.35678
magnitude: 2.78907 au
magnitude: 7.08924 debye
