program: Gaussian 09
title: 000066174
version: EM64L-G09RevD.01
frameworkgroup: C1[X(C5H5ClN2)]
method: RPBEPBE
basis: SDD
operation: Freq
keyword: #p
keyword: freq=noraman
keyword: PBEPBE/SDD
title: #p freq=noraman PBEPBE/SDD
converged: NO NO NO NO
title: Mulliken charges:
elementType: Cl N N C C C C C H H H H H
charge: -0.070765 -0.064015 -0.635784 0.191448 -0.308695 -0.102277 -0.055029 -0.340637 0.225856 0.258350 0.258682 0.330268 0.312596
chargesum: 0.00000
title: Mulliken charges with hydrogens summed into heavy atoms:
elementType: Cl N N C C C C C
charge: -0.070765 -0.064015 0.007081 0.191448 -0.082838 0.156074 -0.055029 -0.081954
polarizability: 1.22734233e+02 1.66495195e+00 7.23182143e+01 -3.67307090e-03 5.34140103e-03 3.03355933e+01
1716.lowfreq: -14.5746 -10.4882 -0.0035 -0.0034 -0.0030 1.4985 109.5024 234.1154 294.1197
frequency: 109.4851 234.1046 294.1178 359.4355 360.5702 391.4053 416.3446 466.7135 527.9880 623.5943 629.2600 739.6243 812.2341 832.3198 904.7396 945.0919 960.5133 1007.6964 1086.7036 1139.7378 1300.7744 1324.3431 1335.3349 1382.4509 1468.2561 1553.2099 1587.6977 1622.0603 3141.8765 3151.3080 3174.7466 3559.2342 3713.8439
redmass: 5.6196 6.1525 5.3469 1.2437 10.7208 2.9712 3.3838 1.3538 1.7557 8.2818 7.2081 3.8647 1.6699 5.1471 1.3904 1.3404 4.8014 1.6143 2.6588 1.1772 1.2553 2.9410 6.6331 3.1255 3.0204 6.4056 2.5551 1.7373 1.0901 1.0928 1.0970 1.0450 1.1046
irintensity: 1.9072 0.1762 2.6881 182.9887 6.4576 10.9705 13.5765 140.2288 14.5287 2.5877 26.0311 0.6283 58.3652 1.7816 6.4901 0.0051 16.4908 0.6647 35.3157 15.0204 9.9264 0.6576 10.1418 32.7585 208.4698 16.4656 8.5737 373.6279 14.9087 7.1995 4.2620 93.3522 36.6231
temp: 298.150 k
press: 1.00000 atm
elementType: 17 7 7 6 6 6 6 6 1 1 1 1 1
symmnumber: 1
zpe: 246172.4 jmol-1
zpe.correction: 0.093762 hartree
zpe.thermalcorrener: 0.100828 hartree
zpe.thermalcorrenthalpy: 0.101773 hartree
zpe.thermalcorrgfe: 0.062160 hartree
zpe.sumelectzpe: -762.518921 hartree
zpe.sumelectthermal: -762.511855 hartree
zpe.sumelectthermalent: -762.510911 hartree
zpe.sumelectthermalfe: -762.550523 hartree
dipole: 3.3746 2.0846 0.0186
dipole: 3.9666
quadrupole: -43.9324 -49.4475 -56.9719
quadrupole: 3.7498 0.0791 0.0045
quadrupole: 6.1849 0.6698 -6.8547 3.7498 0.0791 0.0045
hfenergy: -762.6126835 hartree
pointgroup: C01 [X(C5H5Cl1N2)]
dipole: -1.3144039 0.8397865 -0.0501088 debye
dipolederiv: -0.8840824 0.0164562 -0.0214669 0.0040087 -0.126626 0.0007136 -0.0210262 0.0010964 -0.0652495 -0.8254018 -0.1941015 -0.0129105 0.3203665 -0.2860415 0.0084944 -0.0186636 -0.0050617 -0.2659141 -1.6340487 -0.0701643 -0.019426 -0.0877139 -0.1049109 -0.0101188 -0.0141282 -0.0095156 -0.7506782 1.9079556 0.0323064 0.0437387 0.1148304 0.0335829 0.0050038 0.0438918 0.0028248 0.1873379 -0.4787175 0.0978385 -0.0085928 -0.4392742 -0.0014615 -0.0131258 -0.0033439 0.0010828 -0.1907525 0.1136932 -0.1253215 0.0058185 -0.0763227 0.1907234 -0.004549 0.0055993 -0.005717 -0.0648747 1.041588 -0.0973858 0.0300976 0.1071672 -0.2939459 0.004872 0.0275894 -0.0003858 -0.082531 0.1699435 0.221213 0.0029994 -0.0639755 0.3551661 -0.0055683 0.0058685 0.0015041 -0.0230369 0.003605 0.0950327 -0.0053679 0.0821334 -0.0608363 0.0045193 -0.0052755 0.0046436 0.1759221 0.0701216 -0.0734915 -0.0015609 -0.0659219 0.0037779 -0.0002138 -0.0016279 -0.0004433 0.1566485 0.035057 0.0735113 -0.0033281 0.0901792 -0.0091959 0.0038417 -0.0035062 0.0035608 0.1323577 0.2395058 0.0317408 -0.0051292 0.0511739 0.1755255 0.0032243 -0.0074346 0.002238 0.3912272 0.2407807 -0.0076343 -0.004872 -0.0366511 0.1242421 0.0029066 -0.007943 0.0041729 0.3995433 unknown
polarizability: 122.6089579|-2.4054691|72.3749356|2.4351623|-0.4877754|30.4041469 unknown
InChI: InChI=1S/C5H5ClN2/c6-4-1-2-5(7)8-3-4/h1-3H,7H2
charge 0 multiplicity 1
13 atoms
Cl 3.162382 -0.072424 0.06404
N  -0.774126 -1.189479 -0.027433
N  -2.80997 -0.047357 -0.091603
C  -1.428178 0.018113 -0.056225
C  -0.726363 1.264064 -0.050409
C  0.678712 1.246516 -0.01364
C  1.3369 -0.001852 0.016197
C  0.586377 -1.192213 0.008308
H  -1.269901 2.214299 -0.073692
H  1.25006 2.179135 -0.007964
H  1.075249 -2.171571 0.031453
H  -3.243207 -0.967778 -0.097097
H  -3.387236 0.786847 -0.122135
