program: Orca
programVersion: 5.0.2
elementType: Cl P O O O O O N C C C C C C C C C C H H H H H H H H H H H H H H H H H H H
charge: 0
multiplicity: 1
keywords: wb97x-d3
keywords: def2-TZVPP
keywords: def2/J RIJCOSX
keywords: DEFGRID2
keywords: scfconv7
keywords: smallprint printgap noloewdin
keywords: NOSOSCF
formula: C10H19ClNO5P
InChI: InChI=1/C10H19ClNO5P/c1-6-12(7-2)10(13)9(11)8(3)17-18(14,15-4)16-5/h6-7H2,1-5H3
37 atoms
Cl -0.48213 0.192588 -2.268586
P  2.768892 -0.311072 0.035454
O  1.268499 -0.839486 -0.218542
O  -2.038666 1.965158 0.293995
O  2.654931 1.256812 0.253872
O  3.068681 -0.842023 1.496701
O  3.666152 -0.771884 -1.040259
N  -3.196586 0.122155 -0.338135
C  -4.467382 0.7383 0.033158
C  -3.195946 -1.29338 -0.700939
C  -2.072357 0.822425 -0.153696
C  -4.810677 0.619103 1.508765
C  -2.989169 -2.249072 0.459761
C  -0.784668 0.172047 -0.565889
C  0.121407 -0.281107 0.295148
C  -0.039177 -0.294682 1.77405
C  2.585715 2.16231 -0.859474
C  4.399081 -0.741635 2.034413
H  -4.442633 1.786981 -0.260546
H  -5.242205 0.266984 -0.570614
H  -4.154788 -1.493562 -1.177691
H  -2.443977 -1.475674 -1.467181
H  -5.730512 1.16825 1.712581
H  -4.973475 -0.416027 1.80551
H  -4.027771 1.036949 2.141604
H  -2.01887 -2.107449 0.934621
H  -3.760639 -2.144214 1.221131
H  -3.02704 -3.274062 0.08961
H  0.213653 -1.276961 2.173113
H  0.61563 0.440753 2.245675
H  -1.058596 -0.064971 2.074697
H  3.446683 2.04467 -1.515801
H  2.58566 3.165478 -0.443341
H  1.669743 2.014167 -1.43074
H  4.681319 0.300165 2.18247
H  5.122827 -1.227865 1.381384
H  4.385409 -1.24967 2.993872
elementType: Cl P O N C H
totalener: -1625.17123000 hartree
nucrepener: 1819.45552784 hartree
electener: -3444.62675784 hartree
oneelecener: -5851.93637382 hartree
twoeener: 2407.30961599 hartree
cpcmener: -0.04455722 hartree
kineticenergy: 1620.10247060 hartree
xcener: -115.232473391722 hartree
chargesum: -0.0000000
charge: -0.085619 0.924726 -0.345161 -0.546733 -0.333055 -0.331708 -0.639323 -0.095452 -0.023105 -0.039695 0.306969 -0.273267 -0.275715 0.038049 0.113901 -0.235559 -0.104830 -0.113039 0.090123 0.096358 0.100025 0.101693 0.102008 0.092379 0.088079 0.093248 0.096093 0.102631 0.121958 0.123492 0.104447 0.122897 0.130963 0.117118 0.126595 0.119145 0.129366
qa: -0.0856 0.9247 -0.3452 -0.5467 -0.3331 -0.3317 -0.6393 -0.0955 -0.0231 -0.0397 0.3070 -0.2733 -0.2757 0.0380 0.1139 -0.2356 -0.1048 -0.1130 0.0901 0.0964 0.1000 0.1017 0.1020 0.0924 0.0881 0.0932 0.0961 0.1026 0.1220 0.1235 0.1044 0.1229 0.1310 0.1171 0.1266 0.1191 0.1294
va: 1.2355 5.5925 2.1252 1.9348 2.0586 2.1018 1.9782 3.2130 3.8509 3.8962 4.1668 3.9119 3.9153 3.8447 3.8461 3.9507 3.8250 3.8280 1.0147 1.0050 1.0014 1.0036 1.0068 0.9994 1.0096 0.9964 0.9997 1.0094 1.0003 1.0072 1.0111 0.9992 0.9903 0.9930 0.9890 0.9956 0.9891
dispcorr: -0.019810229 hartree
energy: -1625.191040224363
dipole: -19.18964 17.79384 -1.39580 -2.55606 1.83414 -0.72192 16.83545 -15.22988 1.60557
magnitude: 2.24662 au
magnitude: 5.71044 debye
