program: Orca
programVersion: 5.0.2
elementType: Cl P O O O O O N C C C C C C C C C C H H H H H H H H H H H H H H H H H H H
charge: 0
multiplicity: 1
keywords: wb97x-d3
keywords: def2-TZVPP
keywords: def2/J RIJCOSX
keywords: DEFGRID2
keywords: scfconv7
keywords: smallprint printgap noloewdin
keywords: NOSOSCF
formula: C10H19ClNO5P
InChI: InChI=1/C10H19ClNO5P/c1-6-12(7-2)10(13)9(11)8(3)17-18(14,15-4)16-5/h6-7H2,1-5H3
37 atoms
Cl -0.736938 -0.943498 2.06206
P  2.756244 0.580519 -0.150024
O  1.327422 0.320053 0.541659
O  -2.802021 1.567842 1.019177
O  3.731286 -0.095891 0.893879
O  2.642557 -0.367003 -1.420135
O  3.132149 1.983546 -0.405102
N  -3.135917 -0.27868 -0.243744
C  -4.539965 0.05021 -0.467442
C  -2.641345 -1.501863 -0.863757
C  -2.38372 0.536908 0.497983
C  -5.44475 -0.42258 0.656176
C  -2.218706 -1.309235 -2.307453
C  -0.955417 0.136392 0.727057
C  0.08347 0.66676 0.087236
C  -0.032703 1.626789 -1.043867
C  3.611322 -1.470233 1.2950
C  3.663282 -0.346223 -2.43119
H  -4.641971 1.124892 -0.61476
H  -4.835521 -0.418148 -1.406099
H  -1.815701 -1.907333 -0.28284
H  -3.441347 -2.241258 -0.800439
H  -5.367757 -1.500833 0.800636
H  -5.204189 0.067291 1.599342
H  -6.482954 -0.192078 0.416201
H  -3.034138 -0.917217 -2.916641
H  -1.374312 -0.623578 -2.384338
H  -1.91565 -2.265383 -2.734218
H  -1.072037 1.824214 -1.290922
H  0.435941 2.578868 -0.794277
H  0.443627 1.239439 -1.945294
H  3.518162 -2.133637 0.435896
H  2.754988 -1.603962 1.954571
H  4.521462 -1.716716 1.834347
H  3.349476 -1.042678 -3.2038
H  4.621984 -0.669999 -2.026289
H  3.764407 0.648039 -2.864466
elementType: Cl P O N C H
totalener: -1625.17347434 hartree
nucrepener: 1799.85170963 hartree
electener: -3425.02518397 hartree
oneelecener: -5812.35098367 hartree
twoeener: 2387.32579971 hartree
cpcmener: -0.04938091 hartree
kineticenergy: 1620.09025140 hartree
xcener: -115.231737607516 hartree
chargesum: -0.0000000
charge: -0.091583 0.920538 -0.306887 -0.557205 -0.350925 -0.337154 -0.634055 -0.082753 -0.031531 -0.044286 0.305183 -0.253309 -0.259552 -0.002015 0.160268 -0.262763 -0.099715 -0.114025 0.087127 0.099494 0.099222 0.104110 0.084893 0.084437 0.097580 0.088538 0.087272 0.098839 0.106802 0.132580 0.119519 0.122017 0.115962 0.128938 0.129978 0.130663 0.123800
qa: -0.0916 0.9205 -0.3069 -0.5572 -0.3509 -0.3372 -0.6341 -0.0828 -0.0315 -0.0443 0.3052 -0.2533 -0.2596 -0.0020 0.1603 -0.2628 -0.0997 -0.1140 0.0871 0.0995 0.0992 0.1041 0.0849 0.0844 0.0976 0.0885 0.0873 0.0988 0.1068 0.1326 0.1195 0.1220 0.1160 0.1289 0.1300 0.1307 0.1238
va: 1.2301 5.6077 2.1525 1.9246 2.1141 2.0554 1.9727 3.1863 3.8677 3.9180 4.1727 3.9189 3.9182 3.8373 3.8364 3.9370 3.8281 3.8211 1.0152 0.9983 1.0032 0.9949 1.0041 1.0105 1.0055 1.0047 0.9951 1.0076 1.0136 1.0106 0.9989 0.9903 0.9962 0.9908 0.9894 0.9866 0.9977
dispcorr: -0.018935238 hartree
energy: -1625.192409578667
dipole: -16.04111 15.93358 -0.10753 -8.39851 4.77769 -3.62082 -18.50058 15.83054 -2.67003
magnitude: 4.50010 au
magnitude: 11.43836 debye
