program: Orca
programVersion: 5.0.2
elementType: Cl P O O O O O N C C C C C C C C C C H H H H H H H H H H H H H H H H H H H
charge: 0
multiplicity: 1
keywords: wb97x-d3
keywords: def2-TZVPP
keywords: def2/J RIJCOSX
keywords: DEFGRID2
keywords: scfconv7
keywords: smallprint printgap noloewdin
keywords: NOSOSCF
formula: C10H19ClNO5P
InChI: InChI=1/C10H19ClNO5P/c1-6-12(7-2)10(13)9(11)8(3)17-18(14,15-4)16-5/h6-7H2,1-5H3
37 atoms
Cl -0.191075 0.469199 2.29457
P  2.532239 -0.474804 -0.468472
O  1.381484 -1.116662 0.464388
O  -2.935885 -1.265162 1.14728
O  1.887451 0.936732 -0.807062
O  3.704754 -0.26104 0.567461
O  2.965695 -1.285064 -1.622564
N  -2.767005 0.754976 0.135076
C  -4.211102 0.819742 -0.07837
C  -1.938262 1.811526 -0.440551
C  -2.259035 -0.331779 0.724714
C  -4.706267 0.00044 -1.25867
C  -1.62162 1.629582 -1.913327
C  -0.769995 -0.373416 0.900866
C  0.04884 -1.071108 0.122189
C  -0.352503 -1.849243 -1.07991
C  2.165182 1.605032 -2.049122
C  3.549446 0.476536 1.791274
H  -4.713991 0.500968 0.83511
H  -4.466475 1.869258 -0.221257
H  -2.466572 2.75242 -0.285968
H  -1.012372 1.896983 0.123898
H  -4.292562 0.357103 -2.201175
H  -4.458992 -1.055853 -1.154929
H  -5.792051 0.080301 -1.322207
H  -2.518092 1.655504 -2.531784
H  -0.970434 2.439248 -2.244307
H  -1.105996 0.687492 -2.099318
H  -1.431973 -1.891475 -1.199951
H  0.061744 -1.413453 -1.991437
H  0.019557 -2.871807 -1.00338
H  1.811586 1.017471 -2.894999
H  3.230356 1.807238 -2.159105
H  1.62659 2.548053 -2.016524
H  3.040017 -0.128578 2.538813
H  3.00563 1.4077 1.63614
H  4.551318 0.70936 2.140972
elementType: Cl P O N C H
totalener: -1625.17299545 hartree
nucrepener: 1857.07562653 hartree
electener: -3482.24862198 hartree
oneelecener: -5926.38345942 hartree
twoeener: 2444.13483744 hartree
cpcmener: -0.04810556 hartree
kineticenergy: 1620.09870756 hartree
xcener: -115.232791238085 hartree
chargesum: 0.0000000
charge: -0.082540 0.926687 -0.347168 -0.550410 -0.329082 -0.347005 -0.638323 -0.089268 -0.033083 -0.034044 0.305895 -0.263219 -0.303587 0.036037 0.133598 -0.234578 -0.129791 -0.108439 0.093346 0.095860 0.102118 0.095811 0.089131 0.085634 0.101552 0.112639 0.103729 0.094617 0.104984 0.104201 0.131824 0.126588 0.146027 0.129744 0.117674 0.118416 0.134421
qa: -0.0825 0.9267 -0.3472 -0.5504 -0.3291 -0.3470 -0.6383 -0.0893 -0.0331 -0.0340 0.3059 -0.2632 -0.3036 0.0360 0.1336 -0.2346 -0.1298 -0.1084 0.0933 0.0959 0.1021 0.0958 0.0891 0.0856 0.1016 0.1126 0.1037 0.0946 0.1050 0.1042 0.1318 0.1266 0.1460 0.1297 0.1177 0.1184 0.1344
va: 1.2387 5.5821 2.1006 1.9339 2.0422 2.1133 1.9661 3.2001 3.8619 3.8903 4.1679 3.9074 3.9104 3.9426 3.8375 3.9634 3.8149 3.8256 1.0119 1.0036 1.0034 1.0130 1.0017 1.0125 1.0066 1.0032 1.0073 0.9908 1.0124 1.0008 1.0044 0.9910 0.9906 0.9874 0.9936 0.9937 0.9932
dispcorr: -0.021760471 hartree
energy: -1625.194755921827
dipole: -17.22040 16.72734 -0.49306 10.84786 -7.34020 3.50766 -18.20092 17.11601 -1.08491
magnitude: 3.70457 au
magnitude: 9.41626 debye
