program: Gaussian 09
title: 000005952
version: EM64L-G09RevD.01
frameworkgroup: C1[X(C23H32O4)]
method: RPBEPBE
basis: SDD
operation: Freq
keyword: #pfreq=noraman
keyword: PBEPBE/SDD
title: #p freq=noraman PBEPBE/SDD
converged: YES YES NO NO
title: Mulliken charges:
elementType: O O O O C C C C C C C C C C C C C C C C C C C C C C C H H H H H H H H H H H H H H H H H H H H H H H H H H H H H H H H
charge: -0.192920 -0.243264 -0.234927 -0.241867 -0.097650 0.386928 -0.157317 -0.097984 0.231413 -0.249412 -0.536610 -0.534528 -0.560249 -0.475477 -0.482074 -0.824651 0.539800 -0.641286 -0.493072 -0.810555 0.157942 -0.562670 -0.585745 0.178026 -0.436886 0.309928 -0.754200 0.211593 0.230846 0.200738 0.233154 0.201931 0.208325 0.223984 0.226873 0.213163 0.237605 0.264151 0.216779 0.228665 0.217208 0.250909 0.229897 0.224300 0.223039 0.236376 0.217861 0.214671 0.221586 0.228216 0.235589 0.245757 0.231853 0.256023 0.263149 0.263188 0.261818 0.246412 0.243644
chargesum: 0.00000
title: Mulliken charges with hydrogens summed into heavy atoms:
elementType: O O O O C C C C C C C C C C C C C C C C C C C C C C C
charge: -0.192920 -0.243264 -0.234927 -0.241867 0.113943 0.386928 0.073529 0.102754 0.231413 -0.016257 -0.126355 -0.083672 -0.109481 0.005453 -0.036200 -0.119545 0.539800 -0.181870 -0.060540 -0.125164 0.157942 -0.085060 -0.329721 0.178026 0.089452 0.309928 -0.002326
polarizability: 3.43360985e+02 -1.23036090e+01 2.28982224e+02 -1.89385602e+01 -1.64437914e+00 1.93778758e+02
1716.lowfreq: -18.4155 -11.9757 -3.0298 -0.0006 -0.0002 0.0006 19.0774 22.9818 31.6918
frequency: 18.0081 22.6159 31.6548 40.8277 53.5773 65.5446 73.6650 83.2329 93.8906 113.4392 145.2322 147.5241 165.7898 180.3796 197.1761 202.2573 211.5035 225.8979 230.8962 257.6696 263.7775 274.6320 281.1401 294.0297 301.9384 317.3083 319.7327 354.0499 367.0176 388.7144 412.2610 424.1137 434.2522 445.7986 452.7319 489.8842 497.1241 525.5194 528.1748 547.7429 555.1894 556.8352 595.7238 620.4058 639.1508 647.1262 674.7259 680.9393 731.2606 746.1582 774.0012 784.0387 802.8345 821.1804 827.9305 836.5102 857.4875 882.3629 898.5068 904.7562 914.6883 925.5240 935.3805 938.6740 952.9725 961.8994 968.3186 984.6182 999.7706 1003.1532 1011.4716 1024.7099 1028.9715 1030.6436 1039.2007 1042.4710 1051.7062 1073.8086 1076.4997 1090.1911 1100.6105 1113.8161 1116.0083 1123.6786 1126.1541 1134.7203 1159.2884 1179.0619 1182.0758 1188.5471 1195.4736 1199.7307 1205.0370 1215.1423 1223.0405 1229.8921 1236.2535 1245.9160 1250.8943 1269.2874 1275.7883 1278.6030 1285.1246 1291.9839 1302.6917 1317.7642 1320.9980 1323.0764 1326.9140 1331.1778 1335.2166 1340.9404 1344.4285 1347.7111 1352.8362 1353.1752 1369.4353 1383.7062 1389.8044 1401.1287 1410.0495 1440.2096 1453.3020 1454.3417 1456.2548 1457.9064 1465.1644 1467.4338 1469.7572 1472.7255 1476.8996 1479.7200 1485.9414 1491.4753 1493.3831 1584.6204 1623.4023 1635.2046 1668.0399 2909.0982 2914.0035 2950.5232 2951.7496 2961.9459 2964.1467 2972.9714 2975.0233 2980.8212 2986.6590 2987.2530 2991.7743 2994.0651 2995.6335 3008.8574 3014.3535 3017.5360 3036.4998 3039.9825 3041.4391 3051.5064 3053.0812 3063.2310 3078.1132 3078.8076 3081.8158 3082.8114 3083.5061 3096.6838 3101.3992 3118.4503 3142.7638
redmass: 4.7006 5.6706 4.7990 5.8425 3.3305 5.8511 2.1051 1.5186 3.2839 3.8117 2.7171 2.9096 1.8205 1.8699 2.0048 2.7531 1.7095 2.4167 3.0605 2.2821 2.8100 2.5533 2.4046 3.7569 2.9462 5.9236 3.2418 2.4225 3.1164 2.6525 3.1109 3.5497 3.9088 3.0067 3.2713 2.4992 3.6334 2.8503 2.5489 3.0530 2.9456 2.8789 3.2869 4.2879 3.0878 3.6312 3.0138 3.1960 3.3254 2.9883 2.1551 4.5885 2.2018 2.1103 1.7852 2.2699 2.2295 1.4937 2.3136 2.4970 1.9826 1.7466 2.2009 2.2021 1.9015 2.2635 2.3044 2.4717 2.7268 2.0108 2.4628 2.0350 1.8541 1.8810 2.5253 1.7229 2.6377 2.3654 2.7630 1.7139 2.3076 1.9382 2.1832 1.9466 1.9710 1.7265 2.4216 1.4434 1.8109 1.8789 2.7774 2.3577 1.5267 1.2385 1.3058 1.4296 1.5621 1.2991 1.3825 1.5531 1.3397 2.0449 1.3884 1.3568 1.3730 1.4058 1.4708 1.4139 1.3846 1.3203 1.4688 1.6277 1.8732 1.4740 1.4224 1.4796 1.4956 1.2386 1.2097 1.2017 1.1024 1.0794 1.0559 1.0533 1.0858 1.0795 1.0859 1.0798 1.0868 1.0701 1.0746 1.0556 1.0570 1.0839 1.0644 10.0310 7.7594 8.4773 9.4224 1.0818 1.0798 1.0607 1.0664 1.0784 1.0779 1.0680 1.0646 1.0628 1.0374 1.0629 1.0479 1.0621 1.0539 1.0375 1.0934 1.0634 1.0960 1.0987 1.0989 1.1008 1.1006 1.0958 1.0980 1.0989 1.1034 1.0989 1.0969 1.0985 1.0955 1.0911 1.1020
irintensity: 0.4031 1.8466 2.4941 1.3667 1.9426 0.3390 3.1863 0.5916 2.7140 2.7294 1.0697 0.9425 1.7570 0.8105 0.4269 1.0446 1.0500 0.3695 1.2767 0.4686 1.1967 11.6651 6.5895 3.6727 0.9419 7.5477 3.1950 0.3739 2.6968 0.6658 2.3102 2.0636 6.4397 11.8426 1.6867 0.4295 5.1656 0.1780 0.2816 2.0002 2.7806 0.7804 1.4151 3.4626 0.7945 0.1584 8.7900 5.8233 6.6698 4.4902 5.7957 31.9356 0.2170 0.8322 2.1638 1.1828 13.3513 15.0242 14.2609 24.6585 1.3914 1.7515 9.3819 7.5075 6.9952 8.8760 6.7752 0.9005 15.6318 2.9490 114.3084 8.5814 3.4114 5.1060 20.7377 19.0818 20.6513 0.6658 1.6347 11.4138 62.6580 16.8407 5.5470 2.3111 1.1220 4.7750 2.8946 11.2507 14.3491 42.3497 290.7751 21.3560 3.8518 17.0704 3.2954 21.1972 9.4636 28.5314 0.5092 6.0389 0.5609 35.3439 5.2072 0.5420 0.8230 1.7827 17.7654 8.0754 1.1679 2.1122 1.1630 40.4028 4.0489 7.6519 4.0819 5.7097 16.4349 58.9868 14.0405 35.2894 30.7420 18.5493 21.8436 19.0603 20.0336 1.2375 12.3671 7.7740 7.2306 7.7623 2.8877 5.4947 4.1581 11.6967 9.8467 166.9275 207.8649 77.3437 177.5579 0.3370 24.2158 39.9267 13.4646 7.6721 29.0831 32.8822 35.3228 26.4813 20.8456 31.2759 7.1218 24.1726 28.4047 1.5293 53.5164 23.2344 42.9661 8.4198 72.7630 33.2129 22.8922 21.8963 50.3786 18.0946 34.9860 24.8819 3.2452 21.2892 8.2865 10.6513 10.1978
temp: 298.150 k
press: 1.00000 atm
elementType: 8 8 8 8 6 6 6 6 6 6 6 6 6 6 6 6 6 6 6 6 6 6 6 6 6 6 6 1 1 1 1 1 1 1 1 1 1 1 1 1 1 1 1 1 1 1 1 1 1 1 1 1 1 1 1 1 1 1 1
symmnumber: 1
zpe: 1321586.4 jmol-1
zpe.correction: 0.503366 hartree
zpe.thermalcorrener: 0.530008 hartree
zpe.thermalcorrenthalpy: 0.530952 hartree
zpe.thermalcorrgfe: 0.445658 hartree
zpe.sumelectzpe: -1194.476718 hartree
zpe.sumelectthermal: -1194.450076 hartree
zpe.sumelectthermalent: -1194.449132 hartree
zpe.sumelectthermalfe: -1194.534426 hartree
dipole: -1.6383 -0.4745 1.5936
dipole: 2.3343
quadrupole: -229.5465 -155.9918 -163.9402
quadrupole: 21.3397 10.8395 -2.9625
quadrupole: -46.3870 27.1677 19.2193 21.3397 10.8395 -2.9625
hfenergy: -1194.9800841 hartree
pointgroup: C01 [X(C23H32O4)]
dipole: 0.6538923 -0.1271064 -0.6322016 debye
polarizability: 343.2714369|15.5442292|228.9935855|-16.3173771|4.2260738|193.856944 unknown
InChI: InChI=1S/C23H32O4/c1-14(24)27-13-21(26)20-7-6-18-17-5-4-15-12-16(25)8-10-22(15,2)19(17)9-11-23(18,20)3/h12,17-20H,4-11,13H2,1-3H3
charge 0 multiplicity 1
59 atoms
O  4.441718 0.991085 -0.755526
O  5.424944 -1.461286 0.045287
O  -7.136098 -1.32933 1.029688
O  6.888065 -0.138906 1.295767
C  0.120798 1.400613 0.417127
C  1.189889 0.412083 -0.154401
C  -1.279768 1.223507 -0.206629
C  -1.755243 -0.246518 0.032576
C  -3.205386 -0.546299 -0.536108
C  2.449422 0.910365 0.672087
C  0.716953 -1.028528 0.150932
C  -0.697624 -1.286565 -0.436593
C  0.813353 2.782875 0.350565
C  2.315938 2.470438 0.663484
C  -2.296127 2.215065 0.402067
C  1.441401 0.600179 -1.674153
C  -4.170922 0.540486 -0.027158
C  -3.718947 1.982993 -0.160329
C  -3.660511 -1.946398 -0.016869
C  -3.231428 -0.524864 -2.098497
C  3.786401 0.40658 0.143256
C  -5.175169 -2.204854 -0.152537
C  -5.408408 0.249128 0.489894
C  -5.994692 -1.105539 0.520635
C  4.304187 -0.886232 0.794388
C  6.696046 -0.925498 0.345097
C  7.721959 -1.445981 -0.630879
H  0.015126 1.143162 1.497529
H  -1.217546 1.421438 -1.297761
H  -1.84305 -0.354584 1.139752
H  2.317556 0.524385 1.70527
H  0.687036 -1.17982 1.251176
H  1.417701 -1.77973 -0.265715
H  -0.632466 -1.28833 -1.540918
H  -1.017439 -2.302641 -0.14068
H  0.385396 3.501664 1.07095
H  0.703242 3.226343 -0.657343
H  2.990795 2.894037 -0.099923
H  2.624194 2.885879 1.638994
H  -1.985861 3.256776 0.195702
H  -2.310197 2.092188 1.504861
H  1.885123 1.583914 -1.901117
H  2.147126 -0.16331 -2.0490
H  0.510197 0.505728 -2.257677
H  -3.713287 2.256338 -1.237496
H  -4.447702 2.653799 0.330077
H  -3.383788 -2.029051 1.054144
H  -3.107719 -2.738876 -0.554378
H  -2.845538 0.425615 -2.506752
H  -2.62113 -1.345551 -2.514957
H  -4.262747 -0.650392 -2.473462
H  -5.46127 -3.178239 0.283498
H  -5.469875 -2.238044 -1.221514
H  -6.053632 1.05221 0.87011
H  3.519453 -1.660739 0.813478
H  4.616269 -0.651592 1.832635
H  7.644836 -0.867717 -1.569414
H  7.533055 -2.503927 -0.873221
H  8.732595 -1.318233 -0.216418
