program: Orca
programVersion: 5.0.2
elementType: Cl P O O O O O N C C C C C C C C C C H H H H H H H H H H H H H H H H H H H
charge: 0
multiplicity: 1
keywords: wb97x-d3
keywords: def2-TZVPP
keywords: def2/J RIJCOSX
keywords: DEFGRID2
keywords: scfconv7
keywords: smallprint printgap noloewdin
keywords: NOSOSCF
formula: C10H19ClNO5P
InChI: InChI=1/C10H19ClNO5P/c1-6-12(7-2)10(13)9(11)8(3)17-18(14,15-4)16-5/h6-7H2,1-5H3
37 atoms
Cl -0.853292 0.724605 -2.110543
P  2.516074 0.099724 -0.468067
O  1.389306 1.245309 -0.348876
O  -2.909254 1.803963 0.395213
O  3.151819 -0.084251 0.979462
O  1.624031 -1.20035 -0.605848
O  3.471551 0.43363 -1.536667
N  -2.740638 -0.452557 0.470857
C  -4.079354 -0.597652 1.028526
C  -2.00178 -1.679259 0.197841
C  -2.278085 0.773867 0.200728
C  -5.157875 -0.640899 -0.039297
C  -1.240818 -2.204168 1.400882
C  -0.899236 0.851057 -0.387463
C  0.198524 1.091948 0.320343
C  0.246269 1.283808 1.7944
C  4.183368 0.802566 1.431168
C  2.215469 -2.502413 -0.713089
H  -4.092008 -1.518901 1.612143
H  -4.268848 0.214681 1.729344
H  -2.725379 -2.422812 -0.141142
H  -1.321899 -1.530277 -0.6382
H  -6.13428 -0.792617 0.422645
H  -5.198718 0.289661 -0.605385
H  -4.992095 -1.45993 -0.740828
H  -0.481115 -1.497136 1.733382
H  -1.906199 -2.405219 2.24177
H  -0.740289 -3.13894 1.145082
H  0.717601 2.240481 2.027934
H  -0.745329 1.286458 2.24055
H  0.829792 0.501062 2.281117
H  3.837089 1.836507 1.455802
H  5.06833 0.731116 0.79952
H  4.440547 0.493862 2.441054
H  1.439231 -3.170844 -1.075895
H  2.563809 -2.847635 0.259738
H  3.044232 -2.507751 -1.421632
elementType: Cl P O N C H
totalener: -1625.17914081 hartree
nucrepener: 1849.20845151 hartree
electener: -3474.38759233 hartree
oneelecener: -5911.02631993 hartree
twoeener: 2436.63872761 hartree
cpcmener: -0.03973947 hartree
kineticenergy: 1620.11269358 hartree
xcener: -115.231082930241 hartree
chargesum: 0.0000000
charge: -0.080606 0.900093 -0.352984 -0.514730 -0.342490 -0.311725 -0.606278 -0.086812 -0.033289 -0.046275 0.296394 -0.251535 -0.275771 0.004291 0.173163 -0.257047 -0.115470 -0.125869 0.096379 0.087763 0.106395 0.090496 0.095779 0.086862 0.082008 0.085841 0.097381 0.099243 0.126180 0.108631 0.108008 0.123393 0.125342 0.127180 0.121937 0.127145 0.130979
qa: -0.0806 0.9001 -0.3530 -0.5147 -0.3425 -0.3117 -0.6063 -0.0868 -0.0333 -0.0463 0.2964 -0.2515 -0.2758 0.0043 0.1732 -0.2570 -0.1155 -0.1259 0.0964 0.0878 0.1064 0.0905 0.0958 0.0869 0.0820 0.0858 0.0974 0.0992 0.1262 0.1086 0.1080 0.1234 0.1253 0.1272 0.1219 0.1271 0.1310
va: 1.2436 5.6196 2.1179 1.9833 2.0611 2.0941 2.0199 3.1678 3.8718 3.9084 4.1803 3.9175 3.9130 3.9381 3.8093 3.9766 3.8323 3.8325 0.9983 1.0163 0.9963 1.0153 1.0062 1.0098 1.0049 0.9974 1.0085 1.0069 1.0020 1.0138 0.9992 0.9863 0.9987 0.9896 0.9874 0.9900 0.9952
dispcorr: -0.020794465 hartree
energy: -1625.199935278780
dipole: -11.04104 11.29057 0.24953 -16.17248 13.12421 -3.04827 19.17092 -16.62649 2.54443
magnitude: 3.97848 au
magnitude: 10.11250 debye
