program: Orca
programVersion: 5.0.2
elementType: Cl P O O O O O N C C C C C C C C C C H H H H H H H H H H H H H H H H H H H
charge: 0
multiplicity: 1
keywords: wb97x-d3
keywords: def2-TZVPP
keywords: def2/J RIJCOSX
keywords: DEFGRID2
keywords: scfconv7
keywords: smallprint printgap noloewdin
keywords: NOSOSCF
formula: C10H19ClNO5P
InChI: InChI=1/C10H19ClNO5P/c1-6-12(7-2)10(13)9(11)8(3)17-18(14,15-4)16-5/h6-7H2,1-5H3
37 atoms
Cl -0.325473 -1.664839 1.193339
P  2.267794 0.124327 -0.52751
O  1.430129 0.594768 0.771166
O  -2.781377 0.752558 1.881114
O  3.27825 1.35024 -0.615802
O  3.104978 -1.127057 -0.035674
O  1.469094 -0.184135 -1.726551
N  -3.002512 -0.212821 -0.152678
C  -4.44739 -0.015948 -0.141933
C  -2.423285 -0.752888 -1.376257
C  -2.29079 0.207005 0.901218
C  -4.85883 1.370878 -0.606221
C  -2.630769 -2.248369 -1.538035
C  -0.810625 -0.037568 0.863106
C  0.095983 0.917526 0.68662
C  -0.188106 2.349011 0.412269
C  4.329707 1.345284 -1.59096
C  3.849927 -1.125505 1.18922
H  -4.886923 -0.770127 -0.794811
H  -4.830058 -0.213642 0.858797
H  -2.876396 -0.223321 -2.218006
H  -1.361889 -0.513541 -1.413615
H  -4.463363 2.149223 0.046444
H  -4.515446 1.570339 -1.622371
H  -5.946239 1.456021 -0.603018
H  -2.167948 -2.808083 -0.726474
H  -3.687858 -2.514495 -1.574151
H  -2.178439 -2.578909 -2.473631
H  0.210536 2.636498 -0.563689
H  -1.252033 2.572611 0.417835
H  0.292649 2.980413 1.16176
H  3.927417 1.311912 -2.603989
H  5.007933 0.504259 -1.442246
H  4.883064 2.271778 -1.458867
H  4.503372 -1.993684 1.160018
H  3.180795 -1.211934 2.045065
H  4.460944 -0.228433 1.295796
elementType: Cl P O N C H
totalener: -1625.17901022 hartree
nucrepener: 1828.98047696 hartree
electener: -3454.15948718 hartree
oneelecener: -5871.51334377 hartree
twoeener: 2417.35385658 hartree
cpcmener: -0.03534783 hartree
kineticenergy: 1620.09273813 hartree
xcener: -115.227047186240 hartree
chargesum: -0.0000000
charge: -0.082999 0.915683 -0.360805 -0.514262 -0.340550 -0.342087 -0.598041 -0.092775 -0.035343 -0.059559 0.307822 -0.254963 -0.236074 -0.003504 0.186718 -0.225025 -0.117122 -0.108698 0.098436 0.089563 0.100897 0.096869 0.085286 0.083139 0.096305 0.074540 0.086113 0.094821 0.106949 0.094473 0.114160 0.122901 0.120971 0.127803 0.128919 0.116043 0.123396
qa: -0.0830 0.9157 -0.3608 -0.5143 -0.3405 -0.3421 -0.5980 -0.0928 -0.0353 -0.0596 0.3078 -0.2550 -0.2361 -0.0035 0.1867 -0.2250 -0.1171 -0.1087 0.0984 0.0896 0.1009 0.0969 0.0853 0.0831 0.0963 0.0745 0.0861 0.0948 0.1069 0.0945 0.1142 0.1229 0.1210 0.1278 0.1289 0.1160 0.1234
va: 1.2430 5.6010 2.0928 1.9814 2.0875 2.0934 2.0066 3.1798 3.8717 3.9092 4.1591 3.9176 3.9003 4.0050 3.7802 3.9916 3.8432 3.8351 0.9991 1.0154 0.9967 1.0128 1.0111 1.0037 1.0064 1.0189 1.0053 1.0079 1.0057 1.0169 1.0002 0.9942 0.9869 0.9884 0.9883 0.9969 0.9897
dispcorr: -0.019218003 hartree
energy: -1625.198228220974
dipole: -12.29140 13.80798 1.51657 6.65506 -6.22264 0.43242 -11.15388 10.06212 -1.09177
magnitude: 1.91806 au
magnitude: 4.87531 debye
