program: Orca
programVersion: 5.0.2
elementType: Cl P O O O O O N C C C C C C C C C C H H H H H H H H H H H H H H H H H H H
charge: 0
multiplicity: 1
keywords: wb97x-d3
keywords: def2-TZVPP
keywords: def2/J RIJCOSX
keywords: DEFGRID2
keywords: scfconv7
keywords: smallprint printgap noloewdin
keywords: NOSOSCF
formula: C10H19ClNO5P
InChI: InChI=1/C10H19ClNO5P/c1-6-12(7-2)10(13)9(11)8(3)17-18(14,15-4)16-5/h6-7H2,1-5H3
37 atoms
Cl -0.652065 -1.894004 1.184526
P  2.566512 -0.137053 0.228995
O  1.432876 0.146401 1.336888
O  -2.93425 0.55283 1.758066
O  1.81974 -0.801342 -1.007632
O  2.868231 1.332787 -0.288528
O  3.683593 -0.899698 0.809974
N  -2.719404 0.268865 -0.478661
C  -4.091376 0.690686 -0.731091
C  -1.936278 -0.149817 -1.63504
C  -2.26577 0.246863 0.779842
C  -5.090039 -0.443544 -0.586381
C  -1.254521 1.000923 -2.350974
C  -0.8412 -0.190895 0.964587
C  0.183243 0.649564 1.061412
C  0.075919 2.132515 0.988723
C  1.962737 -2.194643 -1.316729
C  3.861462 1.545042 -1.302427
H  -4.345623 1.5125 -0.062182
H  -4.126384 1.094387 -1.743516
H  -1.199197 -0.893821 -1.339507
H  -2.616631 -0.664133 -2.316194
H  -4.858402 -1.267707 -1.262686
H  -5.108785 -0.832879 0.431428
H  -6.093369 -0.089313 -0.826325
H  -1.972218 1.755196 -2.676764
H  -0.516369 1.48765 -1.714152
H  -0.738098 0.63099 -3.23748
H  0.529799 2.576384 1.876809
H  0.594405 2.535147 0.118796
H  -0.957801 2.465871 0.944487
H  3.003176 -2.446185 -1.516994
H  1.376465 -2.37142 -2.214421
H  1.584354 -2.827197 -0.515654
H  3.978363 2.620578 -1.40553
H  3.541505 1.127237 -2.257237
H  4.818865 1.109506 -1.015912
elementType: Cl P O N C H
totalener: -1625.17846285 hartree
nucrepener: 1855.15768014 hartree
electener: -3480.33614299 hartree
oneelecener: -5922.71457467 hartree
twoeener: 2442.37843167 hartree
cpcmener: -0.03825786 hartree
kineticenergy: 1620.10927683 hartree
xcener: -115.231050767346 hartree
chargesum: 0.0000000
charge: -0.080063 0.905996 -0.347952 -0.514043 -0.337611 -0.332100 -0.608302 -0.089027 -0.033201 -0.036791 0.298654 -0.251285 -0.264073 -0.003363 0.169683 -0.242953 -0.120388 -0.117117 0.087855 0.096523 0.082717 0.106054 0.081911 0.086844 0.096013 0.092572 0.083830 0.099890 0.125234 0.105271 0.105677 0.133233 0.128134 0.120919 0.125713 0.122391 0.123156
qa: -0.0801 0.9060 -0.3480 -0.5140 -0.3376 -0.3321 -0.6083 -0.0890 -0.0332 -0.0368 0.2987 -0.2513 -0.2641 -0.0034 0.1697 -0.2430 -0.1204 -0.1171 0.0879 0.0965 0.0827 0.1061 0.0819 0.0868 0.0960 0.0926 0.0838 0.0999 0.1252 0.1053 0.1057 0.1332 0.1281 0.1209 0.1257 0.1224 0.1232
va: 1.2462 5.6147 2.1325 1.9845 2.0416 2.0955 2.0139 3.1731 3.8744 3.9206 4.1760 3.9153 3.9164 3.9467 3.7997 3.9727 3.8204 3.8367 1.0152 0.9983 1.0044 0.9971 1.0047 1.0106 1.0062 1.0075 0.9969 1.0080 1.0042 1.0023 1.0119 0.9996 0.9873 0.9943 0.9898 0.9907 0.9940
dispcorr: -0.020897734 hartree
energy: -1625.199360587834
dipole: -13.73885 13.44586 -0.29298 10.52719 -9.66608 0.86111 -21.92292 17.88803 -4.03489
magnitude: 4.13615 au
magnitude: 10.51325 debye
