program: Gaussian 09
title: 000066272
version: EM64L-G09RevD.01
frameworkgroup: C1[X(C10H19O6PS2)]
method: RPBEPBE
basis: SDD
operation: Freq
keyword: #p
keyword: freq=noraman
keyword: PBEPBE/SDD
title: #p freq=noraman PBEPBE/SDD
converged: YES YES NO NO
title: Mulliken charges:
elementType: S S P O O O O O O C C C C C C C C C C H H H H H H H H H H H H H H H H H H H
charge: -0.000044 -0.217076 0.662224 -0.245906 -0.481889 -0.256411 -0.637570 -0.319206 -0.250958 -0.612183 -0.509874 0.433243 0.282530 -0.223370 -0.219892 -0.228308 -0.667782 -0.661275 -0.669912 0.378579 0.264364 0.276048 0.242948 0.239464 0.235067 0.236642 0.229436 0.234187 0.206126 0.229012 0.247937 0.231598 0.235919 0.221812 0.434463 0.234917 0.230038 0.215102
chargesum: 0.00000
title: Mulliken charges with hydrogens summed into heavy atoms:
elementType: S S P O O O O O O C C C C C C C C C C
charge: -0.000044 -0.217076 0.662224 -0.245906 -0.481889 -0.256411 -0.203107 -0.319206 -0.250958 -0.233604 0.030539 0.433243 0.282530 0.259042 0.251817 0.235315 0.021546 0.021800 0.010144
polarizability: 2.43515766e+02 2.34175141e+01 2.03266997e+02 1.00534764e+01 5.69812951e+00 1.56103876e+02
1716.lowfreq: -7.8079 0.0007 0.0009 0.0027 3.1160 6.2525 18.0037 19.7075 31.2697
frequency: 16.9975 19.5632 31.2218 46.2837 49.6593 55.3165 65.9086 67.1893 82.5508 87.2820 97.2728 117.0482 123.7795 135.6648 147.5791 158.8892 182.2026 213.1412 224.9669 232.1044 242.3758 244.3604 256.2065 259.6370 274.9507 313.5288 318.7366 332.8034 354.9993 378.5815 391.3858 401.9064 507.6338 528.9400 543.1683 593.8899 643.9385 681.4970 693.9549 746.1998 797.8332 798.3061 799.8262 809.2822 810.7528 813.3564 843.0813 866.6941 918.0935 930.6707 959.2020 1015.0226 1018.6104 1020.2461 1092.7107 1106.7064 1114.2147 1115.3733 1134.3246 1135.3308 1137.4145 1138.2499 1180.6755 1222.3886 1233.7488 1250.4592 1251.4192 1260.0776 1268.8804 1296.2997 1345.9648 1354.2501 1359.5572 1368.4506 1392.1802 1402.4438 1404.9183 1436.6681 1458.8586 1463.6550 1465.0848 1469.9003 1470.3726 1473.2202 1482.5950 1483.8736 1485.5494 1575.2352 1632.5730 2861.4998 2994.5460 2996.7913 2998.0961 2999.0253 3000.1053 3006.2213 3013.4362 3023.3185 3064.3401 3073.2616 3084.1878 3091.0535 3092.9938 3094.8204 3096.9358 3110.4475 3114.4476 3117.5537
redmass: 4.2928 4.2215 3.6400 2.6885 3.1133 2.5389 4.1609 5.3038 2.6713 4.8267 8.7098 5.8513 4.0090 3.2185 3.5785 5.8033 3.1934 3.4210 4.2495 2.9616 1.6526 1.7113 1.9063 2.9897 3.3125 5.6527 5.0751 5.0996 8.4728 4.4488 3.6853 6.9895 4.9172 4.5500 11.6157 3.9992 7.0256 7.2138 4.8716 6.9898 1.2238 3.9919 1.1021 1.5615 2.6470 3.0541 1.0881 3.9848 5.4192 3.5910 2.8280 2.3012 2.4656 2.2970 3.6778 2.2340 2.2668 2.2980 1.4589 1.5042 1.4729 1.7027 1.6361 2.6724 1.2176 1.1374 1.1342 1.1378 1.2433 1.3401 1.3900 1.2585 1.4629 1.6658 1.2453 1.2693 1.2639 1.0801 1.0403 1.0398 1.0393 1.0709 1.0650 1.0622 1.0642 1.0641 1.0678 8.5673 9.6078 1.0746 1.0442 1.0722 1.0360 1.0588 1.0364 1.0654 1.0582 1.0583 1.1084 1.1067 1.1063 1.0972 1.0948 1.0985 1.0984 1.1028 1.1040 1.1025
irintensity: 0.9465 0.8967 1.0139 0.6682 0.1438 0.1091 1.1139 0.4455 2.0217 1.6099 1.7595 1.3089 0.3430 2.2215 2.5635 2.7656 6.2170 2.4515 5.4750 4.3224 5.1160 0.6775 4.0361 11.1239 3.5745 7.5996 8.9441 20.6461 24.0411 20.4307 10.0567 42.5185 15.7260 6.4677 107.1042 10.5060 6.4170 88.6650 2.6009 8.6201 14.9966 84.8903 4.1476 6.1348 14.1020 15.3397 122.6232 153.0681 44.6761 8.5016 57.9023 155.2568 32.9961 77.7454 28.8822 7.6220 9.5347 3.9387 6.9654 26.1668 36.3058 157.1765 231.6107 398.4504 74.3628 1.0468 2.0980 9.8400 137.9164 118.1133 31.8463 4.7701 4.7783 26.5938 30.9273 18.9724 25.9256 37.7060 9.4287 12.0246 14.1778 5.7055 9.3388 3.3581 11.1419 15.6243 14.1620 173.3336 163.8753 1072.5541 19.1135 67.3718 19.7919 4.1747 11.8311 6.2127 14.9313 10.8096 11.5532 6.2088 1.3086 25.2928 0.8987 26.6045 22.1250 39.3733 36.5047 28.7649
temp: 298.150 k
press: 1.00000 atm
elementType: 16 16 15 8 8 8 8 8 8 6 6 6 6 6 6 6 6 6 6 1 1 1 1 1 1 1 1 1 1 1 1 1 1 1 1 1 1 1
symmnumber: 1
zpe: 762984.2 jmol-1
zpe.correction: 0.290605 hartree
zpe.thermalcorrener: 0.315379 hartree
zpe.thermalcorrenthalpy: 0.316323 hartree
zpe.thermalcorrgfe: 0.232029 hartree
zpe.sumelectzpe: -1979.654467 hartree
zpe.sumelectthermal: -1979.629694 hartree
zpe.sumelectthermalent: -1979.628750 hartree
zpe.sumelectthermalfe: -1979.713043 hartree
dipole: 8.7817 0.3462 1.8982
dipole: 8.9912
quadrupole: -145.9153 -107.3384 -140.6316
quadrupole: 7.8845 -5.0093 0.4142
quadrupole: -14.6202 23.9567 -9.3365 7.8845 -5.0093 0.4142
hfenergy: -1979.9450726 hartree
pointgroup: C01 [X(C10H19O6P1S2)]
dipole: 2.1001351 2.4185119 1.5011806 debye
polarizability: 196.6115055|14.5354028|241.4451539|11.5334865|27.7515359|164.82998 unknown
InChI: InChI=1S/C8H13O4S.C2H6O2PS/c1-3-11-7(9)5-6(13)8(10)12-4-2;1-2-4-5(3)6/h6H,3-5H2,1-2H3;3H,2H2,1H3
charge 0 multiplicity 1
38 atoms
S  -0.494485 -0.276493 -1.599328
S  -2.132726 -3.482739 -2.485941
P  -2.024256 -2.007198 -1.06502
O  -1.206857 2.834236 0.440506
O  -1.47116 -2.427366 0.532495
O  3.263078 0.501179 0.144118
O  -3.447113 -1.194222 -0.667115
O  -2.803136 1.191183 0.189554
O  1.804308 -0.988207 1.182388
C  -0.420741 0.560357 0.130218
C  0.972723 1.177125 0.327283
C  -1.584128 1.529982 0.249927
C  2.015123 0.10083 0.597351
C  -2.314182 3.852943 0.547884
C  -0.391901 -3.455768 0.666807
C  4.39636 -0.45209 0.387194
C  -1.645065 5.20312 0.767553
C  -0.170741 -3.641318 2.163746
C  5.647031 0.195596 -0.1954
H  -0.578315 -0.271186 0.845918
H  0.949554 1.854909 1.203178
H  1.281571 1.792329 -0.532563
H  -2.898656 3.806682 -0.38755
H  -2.967481 3.551665 1.38524
H  -0.733845 -4.382754 0.169832
H  0.522583 -3.081284 0.171073
H  4.471437 -0.626382 1.475729
H  4.145123 -1.410337 -0.101492
H  0.592796 -4.424647 2.327369
H  -1.104119 -3.950954 2.663628
H  0.19509 -2.704826 2.615169
H  -1.054469 5.208588 1.699311
H  -0.978049 5.457496 -0.073257
H  -2.419326 5.987699 0.844531
H  -3.306585 -0.249613 -0.278012
H  5.529713 0.376043 -1.277326
H  5.860973 1.158841 0.298203
H  6.515375 -0.471619 -0.046599
