program: Orca
programVersion: 5.0.2
elementType: Cl P O O O O O N C C C C C C C C C C H H H H H H H H H H H H H H H H H H H
charge: 0
multiplicity: 1
keywords: wb97x-d3
keywords: def2-TZVPP
keywords: def2/J RIJCOSX
keywords: DEFGRID2
keywords: scfconv7
keywords: smallprint printgap noloewdin
keywords: NOSOSCF
formula: C10H19ClNO5P
InChI: InChI=1/C10H19ClNO5P/c1-6-12(7-2)10(13)9(11)8(3)17-18(14,15-4)16-5/h6-7H2,1-5H3
37 atoms
Cl -0.344673 -1.152201 1.798938
P  2.664256 0.66801 -0.533563
O  1.436656 0.684555 0.527843
O  -2.761895 1.348727 1.292861
O  3.740921 -0.142224 0.296519
O  2.232639 -0.328223 -1.68006
O  3.050628 1.992946 -1.045301
N  -2.990164 -0.450663 -0.056627
C  -4.435489 -0.272408 -0.126413
C  -2.414943 -1.468109 -0.925904
C  -2.272261 0.409338 0.678713
C  -4.859381 0.733485 -1.182687
C  -2.636852 -2.887663 -0.434913
C  -0.794578 0.165414 0.770142
C  0.13079 0.94807 0.218423
C  -0.160653 2.091446 -0.689082
C  4.433295 0.460933 1.399824
C  1.938874 -1.717256 -1.478381
H  -4.877659 -1.244929 -0.343404
H  -4.807799 0.023047 0.853792
H  -2.858161 -1.346951 -1.917391
H  -1.350704 -1.275356 -1.051682
H  -4.475553 1.730647 -0.967775
H  -4.513478 0.440941 -2.175205
H  -5.947671 0.79605 -1.218209
H  -2.182392 -3.052032 0.540993
H  -3.696433 -3.135127 -0.361519
H  -2.188125 -3.590618 -1.137766
H  -1.227044 2.288976 -0.755717
H  0.327416 2.999378 -0.333953
H  0.195259 1.893827 -1.702195
H  5.238453 -0.215999 1.672171
H  3.766231 0.5861 2.252695
H  4.857702 1.426018 1.122928
H  2.861348 -2.294971 -1.443478
H  1.348919 -2.038032 -2.332973
H  1.368373 -1.892205 -0.566432
elementType: Cl P O N C H
totalener: -1625.17855494 hartree
nucrepener: 1821.36091659 hartree
electener: -3446.53947154 hartree
oneelecener: -5854.94985446 hartree
twoeener: 2408.41038292 hartree
cpcmener: -0.03700917 hartree
kineticenergy: 1620.09381544 hartree
xcener: -115.230383636548 hartree
chargesum: 0.0000000
charge: -0.092035 0.910542 -0.327811 -0.513188 -0.336689 -0.341766 -0.600561 -0.090344 -0.034432 -0.053529 0.292538 -0.255469 -0.239016 0.007933 0.147363 -0.230691 -0.112178 -0.116254 0.098959 0.088343 0.102207 0.093879 0.086373 0.082194 0.096596 0.075894 0.087765 0.093772 0.098514 0.121053 0.109904 0.127045 0.126151 0.116880 0.137129 0.130221 0.112709
qa: -0.0920 0.9105 -0.3278 -0.5132 -0.3367 -0.3418 -0.6006 -0.0903 -0.0344 -0.0535 0.2925 -0.2555 -0.2390 0.0079 0.1474 -0.2307 -0.1122 -0.1163 0.0990 0.0883 0.1022 0.0939 0.0864 0.0822 0.0966 0.0759 0.0878 0.0938 0.0985 0.1211 0.1099 0.1270 0.1262 0.1169 0.1371 0.1302 0.1127
va: 1.2282 5.6129 2.1069 1.9815 2.1062 2.0859 2.0175 3.1783 3.8730 3.9282 4.2033 3.9163 3.8973 3.8685 3.8468 3.9428 3.8346 3.8183 0.9990 1.0162 0.9965 0.9897 1.0110 1.0038 1.0063 1.0192 1.0060 1.0076 1.0199 1.0055 1.0062 0.9885 0.9900 0.9950 0.9942 0.9897 0.9970
dispcorr: -0.019785513 hartree
energy: -1625.198340456958
dipole: -18.87533 18.43094 -0.44440 -6.62195 3.89938 -2.72257 -11.49103 10.50882 -0.98221
magnitude: 2.92825 au
magnitude: 7.44302 debye
