program: Orca
programVersion: 5.0.2
elementType: Cl P O O O O O N C C C C C C C C C C H H H H H H H H H H H H H H H H H H H
charge: 0
multiplicity: 1
keywords: wb97x-d3
keywords: def2-TZVPP
keywords: def2/J RIJCOSX
keywords: DEFGRID2
keywords: scfconv7
keywords: smallprint printgap noloewdin
keywords: NOSOSCF
formula: C10H19ClNO5P
InChI: InChI=1/C10H19ClNO5P/c1-6-12(7-2)10(13)9(11)8(3)17-18(14,15-4)16-5/h6-7H2,1-5H3
37 atoms
Cl -0.41452 -1.203679 1.727162
P  2.792493 0.785119 -0.460853
O  1.433656 0.426197 0.345789
O  -2.653664 1.505987 1.06446
O  3.822108 -0.087567 0.366621
O  2.696234 0.036628 -1.84837
O  3.070642 2.222542 -0.610927
N  -3.083267 -0.438331 -0.00575
C  -4.510592 -0.147724 -0.053689
C  -2.630944 -1.599558 -0.759963
C  -2.266291 0.449684 0.579508
C  -4.901234 0.71927 -1.238135
C  -2.958843 -2.925428 -0.095872
C  -0.811229 0.099372 0.656658
C  0.154361 0.797156 0.058298
C  -0.079569 1.932382 -0.876096
C  4.222648 0.294327 1.690512
C  2.497425 -1.378822 -1.967136
H  -5.039988 -1.099447 -0.10268
H  -4.811409 0.324004 0.880684
H  -3.098209 -1.558296 -1.747388
H  -1.559499 -1.519441 -0.936996
H  -4.43173 1.701691 -1.19174
H  -4.624955 0.252547 -2.184873
H  -5.981843 0.866711 -1.248496
H  -2.508368 -3.003748 0.89229
H  -4.03378 -3.077051 0.00807
H  -2.57482 -3.743219 -0.706714
H  -1.139736 2.098527 -1.045312
H  0.344781 2.8563 -0.482077
H  0.373614 1.74132 -1.850636
H  3.414885 0.124329 2.402106
H  4.528927 1.339717 1.727179
H  5.069818 -0.332664 1.95502
H  1.711824 -1.738754 -1.30187
H  3.423459 -1.913502 -1.759412
H  2.200416 -1.566246 -2.995733
elementType: Cl P O N C H
totalener: -1625.17891601 hartree
nucrepener: 1802.90844732 hartree
electener: -3428.08736333 hartree
oneelecener: -5818.23515645 hartree
twoeener: 2390.14779312 hartree
cpcmener: -0.03687345 hartree
kineticenergy: 1620.09608319 hartree
xcener: -115.231840457581 hartree
chargesum: -0.0000000
charge: -0.096953 0.900337 -0.307842 -0.514815 -0.339321 -0.340221 -0.599959 -0.092412 -0.034254 -0.067651 0.292973 -0.255141 -0.236946 -0.006513 0.170291 -0.240378 -0.105852 -0.101538 0.098283 0.088223 0.100634 0.106007 0.085600 0.082307 0.096154 0.076040 0.086722 0.093656 0.097976 0.121757 0.112127 0.121793 0.116448 0.126514 0.111733 0.126046 0.128178
qa: -0.0970 0.9003 -0.3078 -0.5148 -0.3393 -0.3402 -0.6000 -0.0924 -0.0343 -0.0677 0.2930 -0.2551 -0.2369 -0.0065 0.1703 -0.2404 -0.1059 -0.1015 0.0983 0.0882 0.1006 0.1060 0.0856 0.0823 0.0962 0.0760 0.0867 0.0937 0.0980 0.1218 0.1121 0.1218 0.1164 0.1265 0.1117 0.1260 0.1282
va: 1.2248 5.6291 2.1200 1.9788 2.1082 2.0940 2.0176 3.1696 3.8730 3.9248 4.2129 3.9155 3.8956 3.8508 3.8271 3.9483 3.8334 3.8267 0.9988 1.0170 0.9960 0.9920 1.0111 1.0038 1.0066 1.0195 1.0047 1.0074 1.0193 1.0064 1.0066 0.9932 0.9952 0.9888 0.9925 0.9933 0.9904
dispcorr: -0.018770896 hartree
energy: -1625.197686909822
dipole: -19.83286 19.31691 -0.51596 -7.37756 4.34148 -3.03608 -11.11600 9.93341 -1.18259
magnitude: 3.29887 au
magnitude: 8.38505 debye
