program: Orca
programVersion: 5.0.2
elementType: Cl P O O O O O N C C C C C C C C C C H H H H H H H H H H H H H H H H H H H
charge: 0
multiplicity: 1
keywords: wb97x-d3
keywords: def2-TZVPP
keywords: def2/J RIJCOSX
keywords: DEFGRID2
keywords: scfconv7
keywords: smallprint printgap noloewdin
keywords: NOSOSCF
formula: C10H19ClNO5P
InChI: InChI=1/C10H19ClNO5P/c1-6-12(7-2)10(13)9(11)8(3)17-18(14,15-4)16-5/h6-7H2,1-5H3
37 atoms
Cl -0.500939 -0.336994 2.261696
P  2.596888 0.283718 -0.457857
O  1.405777 0.865732 0.462958
O  -2.891729 1.672788 0.856801
O  3.61708 -0.236079 0.637624
O  1.923678 -1.046783 -0.997432
O  3.140398 1.21847 -1.46132
N  -2.921431 -0.373709 -0.112012
C  -4.351302 -0.296499 -0.38539
C  -2.240679 -1.597477 -0.518367
C  -2.318459 0.650006 0.504647
C  -5.197398 -0.759077 0.78801
C  -1.780301 -1.576392 -1.963636
C  -0.852123 0.487386 0.782628
C  0.111929 1.004832 0.028343
C  -0.113792 1.775498 -1.225009
C  4.596999 0.639528 1.213633
C  2.512947 -1.769582 -2.088562
H  -4.612053 0.723351 -0.666327
H  -4.550463 -0.918005 -1.259067
H  -1.395719 -1.794236 0.138027
H  -2.937284 -2.422244 -0.358132
H  -4.959311 -1.785432 1.071231
H  -5.052835 -0.12252 1.660772
H  -6.254651 -0.725462 0.522436
H  -1.023177 -0.810598 -2.132107
H  -1.342998 -2.540549 -2.225753
H  -2.608888 -1.392221 -2.648803
H  -1.171247 1.948519 -1.407943
H  0.376871 2.747866 -1.160822
H  0.287545 1.258242 -2.098497
H  5.245141 0.020481 1.827255
H  4.124786 1.392548 1.8438
H  5.194128 1.128804 0.446043
H  3.489827 -2.165994 -1.812462
H  2.609419 -1.141031 -2.972892
H  1.844541 -2.596729 -2.310326
elementType: Cl P O N C H
totalener: -1625.17901165 hartree
nucrepener: 1823.04089023 hartree
electener: -3448.21990188 hartree
oneelecener: -5858.99077237 hartree
twoeener: 2410.77087049 hartree
cpcmener: -0.03640405 hartree
kineticenergy: 1620.10425703 hartree
xcener: -115.229147167942 hartree
chargesum: -0.0000000
charge: -0.085300 0.937809 -0.340413 -0.515699 -0.350477 -0.329166 -0.609458 -0.088487 -0.031450 -0.049503 0.289415 -0.252136 -0.264621 0.017757 0.133581 -0.241174 -0.115860 -0.120406 0.086856 0.095821 0.097324 0.104609 0.082165 0.087033 0.095795 0.080666 0.098501 0.093052 0.107831 0.131473 0.104913 0.126746 0.126755 0.116830 0.132868 0.121987 0.124365
qa: -0.0853 0.9378 -0.3404 -0.5157 -0.3505 -0.3292 -0.6095 -0.0885 -0.0314 -0.0495 0.2894 -0.2521 -0.2646 0.0178 0.1336 -0.2412 -0.1159 -0.1204 0.0869 0.0958 0.0973 0.1046 0.0822 0.0870 0.0958 0.0807 0.0985 0.0931 0.1078 0.1315 0.1049 0.1267 0.1268 0.1168 0.1329 0.1220 0.1244
va: 1.2365 5.5987 2.1312 1.9798 2.1120 2.0874 1.9834 3.1677 3.8728 3.9128 4.1927 3.9177 3.9158 3.8971 3.8285 3.9437 3.8425 3.8324 1.0165 0.9982 1.0123 0.9953 1.0046 1.0097 1.0061 0.9976 1.0075 1.0075 1.0139 1.0053 1.0013 0.9892 0.9865 0.9956 0.9895 0.9939 0.9883
dispcorr: -0.019593477 hartree
energy: -1625.198605126576
dipole: -13.94270 14.28031 0.33761 -8.63407 6.16722 -2.46685 -15.77817 14.33549 -1.44268
magnitude: 2.87761 au
magnitude: 7.31430 debye
