program: Orca
programVersion: 5.0.2
elementType: Cl P O O O O O N C C C C C C C C C C H H H H H H H H H H H H H H H H H H H
charge: 0
multiplicity: 1
keywords: wb97x-d3
keywords: def2-TZVPP
keywords: def2/J RIJCOSX
keywords: DEFGRID2
keywords: scfconv7
keywords: smallprint printgap noloewdin
keywords: NOSOSCF
formula: C10H19ClNO5P
InChI: InChI=1/C10H19ClNO5P/c1-6-12(7-2)10(13)9(11)8(3)17-18(14,15-4)16-5/h6-7H2,1-5H3
37 atoms
Cl -0.53637 -1.366762 1.070823
P  2.7359 0.451226 0.0255
O  1.430614 -0.163757 -0.695446
O  -2.245211 1.691856 0.69757
O  2.300861 0.381155 1.545673
O  3.749894 -0.756852 -0.130138
O  3.193451 1.759825 -0.480491
N  -3.162361 -0.035437 -0.43613
C  -4.50488 0.518857 -0.286459
C  -3.032302 -1.262619 -1.209037
C  -2.133264 0.620682 0.115325
C  -5.116131 0.301374 1.087347
C  -3.643329 -2.477085 -0.53376
C  -0.774704 -0.013745 0.024242
C  0.214625 0.477965 -0.716059
C  0.095414 1.640899 -1.638137
C  3.044498 1.07767 2.556044
C  4.639792 -0.83201 -1.25282
H  -4.483129 1.583672 -0.523792
H  -5.128902 0.047384 -1.045763
H  -3.513229 -1.098772 -2.176622
H  -1.980981 -1.441824 -1.425494
H  -4.548633 0.80185 1.870723
H  -6.128549 0.707587 1.103453
H  -5.179739 -0.75784 1.33676
H  -3.470298 -3.360206 -1.150097
H  -3.199118 -2.658852 0.444386
H  -4.721929 -2.376496 -0.407527
H  -0.941975 1.889047 -1.850665
H  0.571098 2.528761 -1.218403
H  0.586864 1.416886 -2.585472
H  4.043976 0.656773 2.666656
H  2.498571 0.94668 3.486672
H  3.11811 2.141512 2.332487
H  5.303557 -1.672073 -1.066129
H  5.233411 0.076176 -1.35111
H  4.089653 -1.011022 -2.176818
elementType: Cl P O N C H
totalener: -1625.17777142 hartree
nucrepener: 1803.89556955 hartree
electener: -3429.07334097 hartree
oneelecener: -5821.50590650 hartree
twoeener: 2392.43256553 hartree
cpcmener: -0.03483293 hartree
kineticenergy: 1620.10474657 hartree
xcener: -115.228267112522 hartree
chargesum: 0.0000000
charge: -0.081502 0.961849 -0.352419 -0.512589 -0.333409 -0.350213 -0.618326 -0.087979 -0.050808 -0.070780 0.301444 -0.254028 -0.245193 -0.032740 0.195819 -0.248178 -0.116818 -0.114814 0.094098 0.097404 0.097541 0.110319 0.088672 0.098147 0.085387 0.099093 0.078449 0.091383 0.105119 0.111277 0.115566 0.123472 0.125523 0.119173 0.128108 0.116873 0.125078
qa: -0.0815 0.9618 -0.3524 -0.5126 -0.3334 -0.3502 -0.6183 -0.0880 -0.0508 -0.0708 0.3014 -0.2540 -0.2452 -0.0327 0.1958 -0.2482 -0.1168 -0.1148 0.0941 0.0974 0.0975 0.1103 0.0887 0.0981 0.0854 0.0991 0.0784 0.0914 0.1051 0.1113 0.1156 0.1235 0.1255 0.1192 0.1281 0.1169 0.1251
va: 1.2431 5.5908 2.1347 1.9846 2.1178 2.1023 1.9814 3.1653 3.8649 3.9160 4.1597 3.9018 3.8921 3.9602 3.7930 3.9731 3.8470 3.8383 1.0125 0.9994 0.9977 0.9941 1.0132 1.0057 1.0020 1.0093 1.0170 0.9989 1.0107 1.0071 1.0027 0.9867 0.9896 0.9945 0.9899 0.9958 0.9863
dispcorr: -0.018219704 hartree
energy: -1625.195991128820
dipole: -18.55606 18.19625 -0.35981 -0.56556 -1.11374 -1.67930 -6.08428 4.87358 -1.21070
magnitude: 2.10127 au
magnitude: 5.34099 debye
