program: Orca
programVersion: 5.0.2
elementType: Cl P O O O O O N C C C C C C C C C C H H H H H H H H H H H H H H H H H H H
charge: 0
multiplicity: 1
keywords: wb97x-d3
keywords: def2-TZVPP
keywords: def2/J RIJCOSX
keywords: DEFGRID2
keywords: scfconv7
keywords: smallprint printgap noloewdin
keywords: NOSOSCF
formula: C10H19ClNO5P
InChI: InChI=1/C10H19ClNO5P/c1-6-12(7-2)10(13)9(11)8(3)17-18(14,15-4)16-5/h6-7H2,1-5H3
37 atoms
Cl -0.526523 -1.367502 1.049375
P  2.733834 0.458856 0.015486
O  1.446335 -0.176664 -0.722282
O  -2.215189 1.703438 0.643592
O  2.266883 0.403624 1.526445
O  3.764505 -0.739349 -0.100749
O  3.189234 1.76498 -0.498302
N  -3.158512 -0.0414 -0.440217
C  -4.495448 0.522799 -0.278798
C  -3.04648 -1.279674 -1.197865
C  -2.117835 0.618966 0.083515
C  -5.086727 0.326738 1.10711
C  -3.660795 -2.479951 -0.50048
C  -0.763367 -0.024117 -0.01055
C  0.226781 0.458996 -0.755701
C  0.107698 1.607726 -1.695357
C  2.989848 1.106147 2.547324
C  4.662994 -0.837848 -1.214225
H  -4.471098 1.58423 -0.530166
H  -5.133647 0.045337 -1.022391
H  -3.535992 -1.12477 -2.16273
H  -1.998886 -1.470502 -1.422577
H  -4.50264 0.831469 1.875497
H  -6.095248 0.741837 1.134677
H  -5.155214 -0.728814 1.370264
H  -4.736903 -2.367974 -0.363328
H  -3.503108 -3.372086 -1.10794
H  -3.207127 -2.654236 0.474788
H  -0.929047 1.866443 -1.896461
H  0.602432 2.495757 -1.299228
H  0.581583 1.360275 -2.645871
H  2.416347 0.995665 3.463893
H  3.083512 2.165544 2.310816
H  3.980303 0.674517 2.692078
H  4.122232 -1.061829 -2.133798
H  5.342056 -1.656671 -0.992717
H  5.238928 0.077709 -1.342893
elementType: Cl P O N C H
totalener: -1625.17769448 hartree
nucrepener: 1805.01586470 hartree
electener: -3430.19355918 hartree
oneelecener: -5823.77038023 hartree
twoeener: 2393.57682105 hartree
cpcmener: -0.03472348 hartree
kineticenergy: 1620.10422561 hartree
xcener: -115.228218837923 hartree
chargesum: -0.0000000
charge: -0.082012 0.961041 -0.353666 -0.512781 -0.332188 -0.350051 -0.617732 -0.087323 -0.050988 -0.070162 0.305090 -0.254149 -0.245156 -0.038383 0.198905 -0.246971 -0.116555 -0.114360 0.093807 0.097480 0.097456 0.109882 0.088827 0.098136 0.085507 0.091405 0.099043 0.078391 0.104117 0.110442 0.115510 0.125281 0.119019 0.123363 0.125029 0.128169 0.116575
qa: -0.0820 0.9610 -0.3537 -0.5128 -0.3322 -0.3501 -0.6177 -0.0873 -0.0510 -0.0702 0.3051 -0.2541 -0.2452 -0.0384 0.1989 -0.2470 -0.1166 -0.1144 0.0938 0.0975 0.0975 0.1099 0.0888 0.0981 0.0855 0.0914 0.0990 0.0784 0.1041 0.1104 0.1155 0.1253 0.1190 0.1234 0.1250 0.1282 0.1166
va: 1.2422 5.5926 2.1331 1.9848 2.1193 2.1036 1.9830 3.1668 3.8648 3.9161 4.1557 3.9023 3.8917 3.9576 3.7932 3.9744 3.8471 3.8381 1.0129 0.9994 0.9976 0.9944 1.0129 1.0057 1.0020 0.9989 1.0094 1.0168 1.0111 1.0081 1.0024 0.9896 0.9946 0.9868 0.9864 0.9896 0.9961
dispcorr: -0.018215526 hartree
energy: -1625.195910002281
dipole: -18.66479 18.27207 -0.39272 -0.60916 -1.10131 -1.71046 -5.75337 4.60189 -1.15148
magnitude: 2.09900 au
magnitude: 5.33524 debye
