program: Orca
programVersion: 5.0.2
elementType: Cl P O O O O O N C C C C C C C C C C H H H H H H H H H H H H H H H H H H H
charge: 0
multiplicity: 1
keywords: wb97x-d3
keywords: def2-TZVPP
keywords: def2/J RIJCOSX
keywords: DEFGRID2
keywords: scfconv7
keywords: smallprint printgap noloewdin
keywords: NOSOSCF
formula: C10H19ClNO5P
InChI: InChI=1/C10H19ClNO5P/c1-6-12(7-2)10(13)9(11)8(3)17-18(14,15-4)16-5/h6-7H2,1-5H3
37 atoms
Cl -0.478529 -1.473553 0.901098
P  2.775419 0.290542 -0.127164
O  1.464672 -0.266485 -0.89053
O  -2.029773 1.668418 0.778093
O  2.349907 0.457731 1.393987
O  3.590625 -1.065064 -0.138497
O  3.402754 1.473792 -0.746009
N  -3.112164 0.068122 -0.399789
C  -4.409749 0.682294 -0.134644
C  -3.095196 -1.106294 -1.260643
C  -2.017641 0.631099 0.125513
C  -4.961034 0.382948 1.249807
C  -3.764517 -2.322687 -0.64741
C  -0.706288 -0.069998 -0.07945
C  0.269775 0.410816 -0.843371
C  0.163948 1.622467 -1.701484
C  1.890571 1.702871 1.937728
C  4.961749 -1.066124 0.285763
H  -4.333562 1.760522 -0.282821
H  -5.099079 0.314656 -0.895053
H  -3.596941 -0.841594 -2.194611
H  -2.067187 -1.340573 -1.529125
H  -5.089015 -0.687327 1.411272
H  -4.314952 0.770225 2.036767
H  -5.937916 0.854766 1.364135
H  -3.291969 -2.609386 0.291422
H  -4.825907 -2.156949 -0.46178
H  -3.683735 -3.164921 -1.335583
H  0.710025 2.463325 -1.267809
H  0.59276 1.422454 -2.684005
H  -0.868136 1.934587 -1.844039
H  2.541992 2.529887 1.656583
H  1.904517 1.592311 3.019066
H  0.870207 1.916527 1.618616
H  5.549101 -0.330502 -0.263381
H  5.351282 -2.058707 0.077053
H  5.038286 -0.870101 1.355357
elementType: Cl P O N C H
totalener: -1625.17691813 hartree
nucrepener: 1820.81389375 hartree
electener: -3445.99081188 hartree
oneelecener: -5854.91985628 hartree
twoeener: 2408.92904440 hartree
cpcmener: -0.03317350 hartree
kineticenergy: 1620.10228302 hartree
xcener: -115.228636185130 hartree
chargesum: 0.0000000
charge: -0.081207 0.931327 -0.341147 -0.515831 -0.336921 -0.345928 -0.609174 -0.081379 -0.048438 -0.068958 0.306637 -0.255515 -0.244783 -0.019743 0.152296 -0.226378 -0.101148 -0.122010 0.093848 0.097319 0.098119 0.111409 0.086083 0.088883 0.098587 0.078578 0.091053 0.099556 0.106129 0.119700 0.104716 0.119456 0.129778 0.112685 0.119242 0.128605 0.124554
qa: -0.0812 0.9313 -0.3411 -0.5158 -0.3369 -0.3459 -0.6092 -0.0814 -0.0484 -0.0690 0.3066 -0.2555 -0.2448 -0.0197 0.1523 -0.2264 -0.1011 -0.1220 0.0938 0.0973 0.0981 0.1114 0.0861 0.0889 0.0986 0.0786 0.0911 0.0996 0.1061 0.1197 0.1047 0.1195 0.1298 0.1127 0.1192 0.1286 0.1246
va: 1.2408 5.6177 2.1268 1.9746 2.0739 2.1258 1.9906 3.2016 3.8614 3.9144 4.1609 3.9053 3.8955 3.9106 3.8170 3.9806 3.8158 3.8403 1.0132 0.9995 0.9974 0.9936 1.0022 1.0119 1.0056 1.0154 0.9990 1.0091 1.0043 1.0032 1.0108 1.0020 0.9904 0.9983 0.9942 0.9894 0.9881
dispcorr: -0.019482428 hartree
energy: -1625.196400559572
dipole: -21.26534 20.05972 -1.20561 2.84845 -3.87969 -1.03124 -1.86126 1.43312 -0.42814
magnitude: 1.64325 au
magnitude: 4.17680 debye
