program: Orca
programVersion: 5.0.2
elementType: Cl P O O O O O N C C C C C C C C C C H H H H H H H H H H H H H H H H H H H
charge: 0
multiplicity: 1
keywords: wb97x-d3
keywords: def2-TZVPP
keywords: def2/J RIJCOSX
keywords: DEFGRID2
keywords: scfconv7
keywords: smallprint printgap noloewdin
keywords: NOSOSCF
formula: C10H19ClNO5P
InChI: InChI=1/C10H19ClNO5P/c1-6-12(7-2)10(13)9(11)8(3)17-18(14,15-4)16-5/h6-7H2,1-5H3
37 atoms
Cl -0.463685 -1.939963 0.896926
P  2.700609 0.616945 0.07334
O  1.311721 -0.064139 -0.385167
O  -2.442229 0.799757 1.701103
O  3.695267 -0.613926 -0.012436
O  3.068554 1.446182 -1.22669
O  2.645508 1.338642 1.357741
N  -3.219098 -0.279193 -0.12769
C  -4.580667 0.18375 0.114143
C  -3.005616 -1.079589 -1.324304
C  -2.247847 0.113836 0.706279
C  -4.826748 1.572156 -0.452253
C  -3.484069 -2.513361 -1.173376
C  -0.849166 -0.333011 0.391069
C  0.068958 0.461308 -0.151223
C  -0.178712 1.853247 -0.615864
C  3.845595 -1.499295 1.106856
C  4.262766 2.240373 -1.269187
H  -5.260535 -0.531591 -0.348391
H  -4.789888 0.161406 1.183107
H  -3.532159 -0.595099 -2.149947
H  -1.950536 -1.06186 -1.591069
H  -4.209127 2.323344 0.040068
H  -4.619147 1.607107 -1.522873
H  -5.870466 1.854897 -0.309177
H  -3.309085 -3.058966 -2.101303
H  -2.95183 -3.02903 -0.374633
H  -4.552208 -2.56825 -0.959541
H  0.12156 1.962598 -1.65903
H  -1.227865 2.128909 -0.541473
H  0.38966 2.574111 -0.024197
H  4.263393 -0.976971 1.966787
H  4.53321 -2.280739 0.794422
H  2.894244 -1.954769 1.38415
H  4.250285 2.770556 -2.217761
H  5.152169 1.611583 -1.223987
H  4.286507 2.965112 -0.45536
elementType: Cl P O N C H
totalener: -1625.17933837 hartree
nucrepener: 1791.11046214 hartree
electener: -3416.28980051 hartree
oneelecener: -5795.55686094 hartree
twoeener: 2379.26706043 hartree
cpcmener: -0.03673119 hartree
kineticenergy: 1620.10495796 hartree
xcener: -115.228622466695 hartree
chargesum: 0.0000000
charge: -0.085509 0.935428 -0.337246 -0.509818 -0.350543 -0.342893 -0.603875 -0.089182 -0.032349 -0.066369 0.277205 -0.260694 -0.233066 0.027464 0.137320 -0.225913 -0.107730 -0.114816 0.097910 0.089404 0.100583 0.111043 0.086871 0.083553 0.099102 0.093091 0.073597 0.086576 0.117891 0.097827 0.114151 0.119737 0.127321 0.114231 0.127437 0.123044 0.119216
qa: -0.0855 0.9354 -0.3372 -0.5098 -0.3505 -0.3429 -0.6039 -0.0892 -0.0323 -0.0664 0.2772 -0.2607 -0.2331 0.0275 0.1373 -0.2259 -0.1077 -0.1148 0.0979 0.0894 0.1006 0.1110 0.0869 0.0836 0.0991 0.0931 0.0736 0.0866 0.1179 0.0978 0.1142 0.1197 0.1273 0.1142 0.1274 0.1230 0.1192
va: 1.2378 5.6057 2.1367 1.9810 2.1044 2.1050 1.9814 3.1678 3.8650 3.9204 4.2017 3.9191 3.9006 3.9278 3.8145 3.9497 3.8401 3.8397 0.9993 1.0165 0.9950 0.9925 1.0096 1.0035 1.0067 1.0080 1.0183 1.0055 1.0034 1.0157 1.0101 0.9951 0.9907 0.9932 0.9889 0.9907 0.9929
dispcorr: -0.018462475 hartree
energy: -1625.197800844991
dipole: -17.36826 17.42513 0.05687 5.29190 -5.89712 -0.60522 -11.41365 8.61953 -2.79411
magnitude: 2.85947 au
magnitude: 7.26820 debye
