program: Orca
programVersion: 5.0.2
elementType: Cl P O O O O O N C C C C C C C C C C H H H H H H H H H H H H H H H H H H H
charge: 0
multiplicity: 1
keywords: wb97x-d3
keywords: def2-TZVPP
keywords: def2/J RIJCOSX
keywords: DEFGRID2
keywords: scfconv7
keywords: smallprint printgap noloewdin
keywords: NOSOSCF
formula: C10H19ClNO5P
InChI: InChI=1/C10H19ClNO5P/c1-6-12(7-2)10(13)9(11)8(3)17-18(14,15-4)16-5/h6-7H2,1-5H3
37 atoms
Cl -0.319405 0.424826 2.281566
P  2.605323 -0.597007 -0.448343
O  1.376561 -1.054728 0.493164
O  -2.910871 -1.466907 0.880472
O  1.990672 0.733153 -1.069087
O  3.698943 -0.203212 0.621864
O  3.119834 -1.585397 -1.411093
N  -2.881555 0.693996 0.204545
C  -4.333778 0.713037 0.069002
C  -2.126709 1.850581 -0.268154
C  -2.298995 -0.437497 0.627144
C  -4.842649 0.1891 -1.263829
C  -1.655792 1.753837 -1.709046
C  -0.813487 -0.400258 0.841751
C  0.066683 -1.051891 0.086933
C  -0.259643 -1.822564 -1.143521
C  2.537549 1.302929 -2.266071
C  3.452299 0.698642 1.709004
H  -4.765984 0.133704 0.884094
H  -4.659251 1.743434 0.214304
H  -2.773003 2.720132 -0.148612
H  -1.272912 2.027481 0.384201
H  -4.529556 0.818833 -2.095807
H  -4.497375 -0.827033 -1.45503
H  -5.93347 0.172263 -1.25764
H  -2.486081 1.64756 -2.406162
H  -1.116801 2.66444 -1.974695
H  -0.977611 0.913344 -1.857195
H  -1.330819 -1.884839 -1.314737
H  0.18495 -1.368816 -2.031823
H  0.127551 -2.839448 -1.062321
H  2.453433 0.612445 -3.104204
H  3.581048 1.586988 -2.129193
H  1.954544 2.194976 -2.478934
H  2.912439 0.195201 2.50911
H  2.898017 1.581146 1.38962
H  4.425587 1.011856 2.078255
elementType: Cl P O N C H
totalener: -1625.17779888 hartree
nucrepener: 1842.45816548 hartree
electener: -3467.63596436 hartree
oneelecener: -5897.21140229 hartree
twoeener: 2429.57543793 hartree
cpcmener: -0.03769237 hartree
kineticenergy: 1620.09876827 hartree
xcener: -115.230149210853 hartree
chargesum: -0.0000000
charge: -0.088727 0.896948 -0.336093 -0.510155 -0.324499 -0.338228 -0.605597 -0.101931 -0.025884 -0.043890 0.296096 -0.270470 -0.269429 0.026989 0.131469 -0.227777 -0.118236 -0.109009 0.090832 0.093377 0.096700 0.100063 0.088390 0.089280 0.099504 0.099933 0.101325 0.076299 0.103697 0.102184 0.132408 0.122151 0.135718 0.122676 0.115180 0.117594 0.131112
qa: -0.0887 0.8969 -0.3361 -0.5102 -0.3245 -0.3382 -0.6056 -0.1019 -0.0259 -0.0439 0.2961 -0.2705 -0.2694 0.0270 0.1315 -0.2278 -0.1182 -0.1090 0.0908 0.0934 0.0967 0.1001 0.0884 0.0893 0.0995 0.0999 0.1013 0.0763 0.1037 0.1022 0.1324 0.1222 0.1357 0.1227 0.1152 0.1176 0.1311
va: 1.2319 5.6123 2.1103 1.9822 2.0446 2.1133 2.0088 3.1893 3.8568 3.8890 4.1887 3.9089 3.9147 3.8878 3.8410 3.9418 3.8303 3.8343 1.0156 1.0046 1.0028 1.0135 1.0010 1.0096 1.0075 1.0041 1.0090 0.9978 1.0170 1.0020 1.0049 0.9951 0.9888 0.9892 0.9943 0.9925 0.9933
dispcorr: -0.020850908 hartree
energy: -1625.198649788290
dipole: -16.95279 16.46935 -0.48343 12.42462 -8.84031 3.58431 -17.87313 16.87660 -0.99652
magnitude: 3.75154 au
magnitude: 9.53566 debye
