program: Orca
programVersion: 5.0.2
elementType: Cl P O O O O O N C C C C C C C C C C H H H H H H H H H H H H H H H H H H H
charge: 0
multiplicity: 1
keywords: wb97x-d3
keywords: def2-TZVPP
keywords: def2/J RIJCOSX
keywords: DEFGRID2
keywords: scfconv7
keywords: smallprint printgap noloewdin
keywords: NOSOSCF
formula: C10H19ClNO5P
InChI: InChI=1/C10H19ClNO5P/c1-6-12(7-2)10(13)9(11)8(3)17-18(14,15-4)16-5/h6-7H2,1-5H3
37 atoms
Cl -0.720401 0.001571 2.213778
P  2.731419 0.337135 -0.25093
O  1.28168 -0.23789 0.159007
O  -2.596002 1.92373 0.172396
O  3.639546 -0.294519 0.882483
O  3.073937 -0.565598 -1.507959
O  2.80032 1.799016 -0.426452
N  -3.190694 -0.234658 -0.161683
C  -4.563083 0.124645 -0.49398
C  -2.885177 -1.658567 -0.116584
C  -2.318616 0.732119 0.151643
C  -5.448149 0.242463 0.734578
C  -2.547366 -2.243551 -1.475232
C  -0.932777 0.28992 0.520822
C  0.081803 0.197722 -0.333054
C  -0.014835 0.48509 -1.790891
C  3.776543 0.347647 2.156355
C  4.255236 -0.318236 -2.282122
H  -4.567188 1.055659 -1.059734
H  -4.949836 -0.645441 -1.162605
H  -2.073075 -1.845922 0.583148
H  -3.757805 -2.164834 0.301393
H  -5.120955 1.052916 1.386167
H  -6.476846 0.448383 0.436353
H  -5.450485 -0.68166 1.314574
H  -3.343246 -2.067642 -2.200378
H  -1.625418 -1.821375 -1.874475
H  -2.410473 -3.322239 -1.390668
H  -1.038086 0.690804 -2.095048
H  0.580705 1.361547 -2.054973
H  0.347047 -0.357992 -2.380397
H  4.080847 1.3884 2.048143
H  4.548541 -0.193337 2.697273
H  2.844307 0.297072 2.719363
H  5.14999 -0.597594 -1.725384
H  4.325216 0.727202 -2.582787
H  4.181998 -0.937787 -3.172102
elementType: Cl P O N C H
totalener: -1625.17963083 hartree
nucrepener: 1793.29062237 hartree
electener: -3418.47025320 hartree
oneelecener: -5799.70331947 hartree
twoeener: 2381.23306628 hartree
cpcmener: -0.03663617 hartree
kineticenergy: 1620.11449489 hartree
xcener: -115.231297412973 hartree
chargesum: -0.0000000
charge: -0.088186 0.941282 -0.328582 -0.512977 -0.350407 -0.344406 -0.604742 -0.094082 -0.034447 -0.058986 0.291338 -0.253004 -0.256470 0.025962 0.134768 -0.268427 -0.107250 -0.112557 0.087841 0.097699 0.102669 0.105125 0.087251 0.096120 0.081675 0.086487 0.090049 0.097800 0.105977 0.129550 0.123615 0.117211 0.126634 0.116592 0.124705 0.117471 0.126700
qa: -0.0882 0.9413 -0.3286 -0.5130 -0.3504 -0.3444 -0.6047 -0.0941 -0.0344 -0.0590 0.2913 -0.2530 -0.2565 0.0260 0.1348 -0.2684 -0.1072 -0.1126 0.0878 0.0977 0.1027 0.1051 0.0873 0.0961 0.0817 0.0865 0.0900 0.0978 0.1060 0.1295 0.1236 0.1172 0.1266 0.1166 0.1247 0.1175 0.1267
va: 1.2350 5.6100 2.1509 1.9800 2.1133 2.1014 1.9841 3.1586 3.8727 3.9307 4.1886 3.9165 3.9148 3.8455 3.8274 3.9400 3.8370 3.8369 1.0164 0.9982 0.9989 0.9952 1.0099 1.0059 1.0050 1.0051 0.9952 1.0085 1.0143 1.0133 0.9970 0.9958 0.9900 0.9930 0.9905 0.9951 0.9890
dispcorr: -0.018566089 hartree
energy: -1625.198196915416
dipole: -15.39062 15.63709 0.24647 -8.44944 5.65663 -2.79281 -12.93828 11.85324 -1.08504
magnitude: 3.00630 au
magnitude: 7.64141 debye
