program: Gaussian 09
title: 000066235
version: EM64L-G09RevD.01
frameworkgroup: C1[X(C13H14N2O2S)]
method: RPBEPBE
basis: SDD
operation: Freq
keyword: #p
keyword: freq=noraman
keyword: PBEPBE/SDD
title: #p freq=noraman PBEPBE/SDD
converged: YES YES NO NO
title: Mulliken charges:
elementType: S O O N N C C C C C C C C C C C C C H H H H H H H H H H H H H H
charge: 0.932380 -0.527304 -0.529457 -0.544954 -0.697861 -0.210327 0.462196 -0.446217 -0.348207 0.539175 0.368961 -0.840571 -0.427612 -0.328571 -0.360675 -0.209404 -0.200482 -0.241575 0.296269 0.292671 0.234975 0.218843 0.234837 0.286477 0.223938 0.286174 0.215908 0.230910 0.227833 0.311635 0.319532 0.230501
chargesum: 0.00000
title: Mulliken charges with hydrogens summed into heavy atoms:
elementType: S O O N N C C C C C C C C C C C C C
charge: 0.932380 -0.527304 -0.529457 -0.252284 -0.066695 -0.210327 0.462196 -0.149947 -0.113231 0.539175 0.368961 -0.100413 -0.203674 -0.042397 -0.144767 0.021506 0.027352 -0.011074
polarizability: 1.95422181e+02 1.44452144e+01 2.02524332e+02 -7.16326442e+00 -9.97288877e+00 1.82885266e+02
1716.lowfreq: -10.3549 -0.0018 -0.0015 -0.0002 4.5701 7.4271 21.7768 25.4235 46.2871
frequency: 21.2476 24.9155 46.1922 89.1772 94.1140 115.5962 128.4043 161.6005 171.6422 188.7244 214.0972 236.5455 266.6971 294.2018 315.7287 325.0292 369.3431 383.0871 401.5374 403.1465 417.9657 432.8640 454.4369 456.0561 469.8152 503.4633 557.5797 588.5422 612.3234 661.8605 688.8269 698.6908 748.5471 759.0837 786.6340 816.9671 820.0030 821.5634 837.1532 858.0030 885.8190 908.7367 945.9218 947.2825 969.3313 982.7015 984.3934 991.9125 1000.1525 1021.8322 1041.9219 1048.3314 1078.3802 1154.0248 1171.6207 1180.9595 1214.6969 1228.1636 1237.7152 1267.4067 1319.1226 1331.2118 1365.2804 1388.2159 1400.3082 1432.1887 1446.8047 1470.4348 1473.3853 1486.8931 1510.0076 1555.6698 1582.6444 1600.5845 1635.6372 1647.9822 2960.2002 3050.2063 3093.6801 3116.3977 3121.0915 3132.5725 3137.9104 3144.6925 3144.8984 3162.8257 3177.3703 3391.2709 3567.2386 3707.0501
redmass: 5.0515 4.6311 4.2140 3.5696 5.0428 1.3910 2.8221 4.4778 5.2956 8.9466 7.6926 7.6986 5.3883 5.1639 3.5323 3.5918 1.1997 4.6787 1.3531 2.3123 2.8735 4.7439 3.4238 3.8854 5.2640 3.4772 5.3361 4.5537 6.1404 7.3667 1.8421 2.7096 4.4384 1.6727 2.2787 4.6368 2.4474 1.6386 1.3920 6.7764 1.5347 1.4910 3.5871 1.6564 1.3898 1.7532 6.0253 1.3290 2.3258 2.1334 1.4007 1.4645 1.5663 1.2434 1.0574 1.1373 1.9699 1.6289 2.1428 1.6902 2.5993 1.2656 3.5619 7.0031 1.2099 4.0627 2.2393 1.1992 1.8654 1.0816 3.8036 5.6382 5.9544 5.9614 2.6120 1.6076 1.0439 1.0888 1.1000 1.0876 1.0871 1.0870 1.0915 1.0966 1.0933 1.0978 1.0981 1.0754 1.0452 1.1042
irintensity: 0.2624 0.6408 0.1742 4.0504 0.1160 2.5266 0.2311 3.3000 4.7420 5.5963 1.9765 4.9257 4.2142 6.3177 2.1598 2.6117 25.9296 38.3427 195.5838 59.0643 5.2018 84.3675 10.2013 18.9966 83.1297 5.1685 3.1135 5.6470 2.0943 2.3448 37.5071 4.8766 0.7479 99.7193 7.5472 128.6581 35.9818 10.8012 26.7888 8.1816 22.5995 4.7934 42.6293 12.2023 0.1306 3.3050 0.2328 0.4624 2.1624 5.0819 4.4830 8.1325 13.5654 22.8742 0.0280 2.3972 7.0087 0.3604 13.5726 3.2653 39.8530 2.6299 11.6786 0.4248 17.5913 8.9782 10.6422 2.9870 41.5090 25.2764 138.7403 17.0291 2.4498 4.3000 14.2635 294.7022 37.1373 26.4427 5.5689 8.8164 11.8255 0.6239 6.1949 27.1420 32.6142 24.4833 6.5575 12.8116 84.2328 23.9424
temp: 298.150 k
press: 1.00000 atm
elementType: 16 8 8 7 7 6 6 6 6 6 6 6 6 6 6 6 6 6 1 1 1 1 1 1 1 1 1 1 1 1 1 1
symmnumber: 1
zpe: 640340.0 jmol-1
zpe.correction: 0.243893 hartree
zpe.thermalcorrener: 0.261824 hartree
zpe.thermalcorrenthalpy: 0.262768 hartree
zpe.thermalcorrgfe: 0.197008 hartree
zpe.sumelectzpe: -1160.325680 hartree
zpe.sumelectthermal: -1160.307748 hartree
zpe.sumelectthermalent: -1160.306804 hartree
zpe.sumelectthermalfe: -1160.372565 hartree
dipole: -1.5811 7.2281 3.2766
dipole: 8.0920
quadrupole: -106.6381 -113.7841 -105.4630
quadrupole: -7.5661 0.0202 -14.4147
quadrupole: 1.9903 -5.1557 3.1654 -7.5661 0.0202 -14.4147
hfenergy: -1160.5695722 hartree
pointgroup: C01 [X(C13H14N2O2S1)]
dipole: -0.429001 -2.8835401 -1.2793617 debye
polarizability: 197.5138989|-14.813685|200.4435325|7.8180882|-9.4422469|182.8743477 unknown
InChI: InChI=1S/C13H14N2O2S/c1-10-7-8-11(14)9-13(10)18(16,17)15-12-5-3-2-4-6-12/h2-9,15H,14H2,1H3
charge 0 multiplicity 1
32 atoms
S  -0.367421 1.841775 0.878467
O  0.017686 1.453414 2.406752
O  -1.07284 3.263531 0.529564
N  1.316159 1.918094 -0.092545
N  -2.441237 -2.909069 1.547704
C  -1.378446 0.371599 0.179985
C  -1.91583 0.41927 -1.126837
C  -1.520346 -0.690229 1.082534
C  -2.661849 -0.736051 -1.488678
C  -2.269345 -1.832451 0.682302
C  2.046743 0.701463 -0.19147
C  -1.72635 1.565274 -2.104721
C  -2.839783 -1.831999 -0.624358
C  2.631464 0.157839 0.98756
C  2.24588 0.049825 -1.441945
C  3.405803 -1.016452 0.904451
C  3.053427 -1.104028 -1.517294
C  3.628238 -1.647729 -0.344293
H  -1.06351 -0.616835 2.075983
H  1.054585 2.345587 -0.999356
H  -3.115813 -0.766119 -2.486403
H  -0.745096 1.502626 -2.618813
H  -2.501099 1.530409 -2.888955
H  -1.784632 2.545925 -1.602146
H  -3.428384 -2.694898 -0.958142
H  2.478127 0.674299 1.93958
H  1.780091 0.457028 -2.348857
H  3.854914 -1.430778 1.813864
H  3.221456 -1.586918 -2.486351
H  -2.98532 -3.719955 1.268654
H  -2.038195 -2.898075 2.480003
H  4.246022 -2.550373 -0.402938
