program: Orca
programVersion: 5.0.2
elementType: Cl P O O O O O N C C C C C C C C C C H H H H H H H H H H H H H H H H H H H
charge: 0
multiplicity: 1
keywords: wb97x-d3
keywords: def2-TZVPP
keywords: def2/J RIJCOSX
keywords: DEFGRID2
keywords: scfconv7
keywords: smallprint printgap noloewdin
keywords: NOSOSCF
formula: C10H19ClNO5P
InChI: InChI=1/C10H19ClNO5P/c1-6-12(7-2)10(13)9(11)8(3)17-18(14,15-4)16-5/h6-7H2,1-5H3
37 atoms
Cl -0.516699 -0.40992 1.971209
P  2.68431 0.317587 -0.188374
O  1.326486 -0.549756 -0.267755
O  -2.287062 1.901246 0.216522
O  2.419382 1.177443 1.114609
O  3.712679 -0.786622 0.300137
O  3.049803 1.054711 -1.413454
N  -3.198368 -0.140116 -0.134189
C  -4.532354 0.418987 -0.315873
C  -3.077333 -1.589549 -0.211867
C  -2.178998 0.685238 0.127272
C  -5.267596 0.616667 0.998109
C  -2.949937 -2.10219 -1.63434
C  -0.82856 0.062883 0.338447
C  0.107625 -0.009479 -0.601563
C  -0.076591 0.401298 -2.020469
C  3.313142 2.241053 1.471939
C  4.331439 -1.662767 -0.65348
H  -4.459304 1.3606 -0.859176
H  -5.088778 -0.265141 -0.956939
H  -2.230255 -1.926249 0.382766
H  -3.962926 -2.015356 0.263885
H  -5.35134 -0.318671 1.5534
H  -4.763699 1.345826 1.632349
H  -6.277973 0.98161 0.809722
H  -3.788197 -1.783462 -2.255768
H  -2.02838 -1.753397 -2.100281
H  -2.93505 -3.19259 -1.636303
H  0.479891 1.312822 -2.24314
H  0.286679 -0.379031 -2.690109
H  -1.12094 0.588517 -2.257654
H  4.329053 1.872871 1.61828
H  2.948208 2.650007 2.410116
H  3.314272 3.025337 0.715763
H  4.948999 -2.354144 -0.086597
H  4.961592 -1.107783 -1.347524
H  3.588055 -2.232211 -1.212506
elementType: Cl P O N C H
totalener: -1625.17878802 hartree
nucrepener: 1805.42495694 hartree
electener: -3430.60374496 hartree
oneelecener: -5824.36423565 hartree
twoeener: 2393.76049069 hartree
cpcmener: -0.03621671 hartree
kineticenergy: 1620.11187981 hartree
xcener: -115.228743759356 hartree
chargesum: -0.0000000
charge: -0.082535 0.957540 -0.353551 -0.513202 -0.335081 -0.348105 -0.614299 -0.092852 -0.032922 -0.047855 0.299173 -0.253070 -0.260827 -0.007184 0.166017 -0.256521 -0.117653 -0.115313 0.087528 0.097130 0.100541 0.103281 0.082349 0.087538 0.096140 0.087043 0.089553 0.097957 0.119547 0.120624 0.100079 0.122835 0.126083 0.120012 0.128056 0.118031 0.123913
qa: -0.0825 0.9575 -0.3536 -0.5132 -0.3351 -0.3481 -0.6143 -0.0929 -0.0329 -0.0479 0.2992 -0.2531 -0.2608 -0.0072 0.1660 -0.2565 -0.1177 -0.1153 0.0875 0.0971 0.1005 0.1033 0.0823 0.0875 0.0961 0.0870 0.0896 0.0980 0.1195 0.1206 0.1001 0.1228 0.1261 0.1200 0.1281 0.1180 0.1239
va: 1.2385 5.5959 2.1333 1.9837 2.1191 2.1026 1.9850 3.1742 3.8708 3.9194 4.1708 3.9186 3.9155 3.9314 3.8089 3.9654 3.8484 3.8422 1.0159 0.9981 1.0018 0.9949 1.0048 1.0102 1.0060 1.0046 0.9961 1.0083 1.0131 0.9968 1.0126 0.9870 0.9896 0.9933 0.9901 0.9944 0.9869
dispcorr: -0.018401072 hartree
energy: -1625.197189091087
dipole: -17.70318 17.29731 -0.40587 -4.80609 2.60413 -2.20196 -11.43038 10.92257 -0.50781
magnitude: 2.29592 au
magnitude: 5.83576 debye
