program: Gaussian 09
title: 000066181
version: EM64L-G09RevD.01
frameworkgroup: C1[X(C14H18)]
method: RPBEPBE
basis: SDD
operation: Freq
keyword: #p
keyword: freq=noraman
keyword: PBEPBE/SDD
title: #p freq=noraman PBEPBE/SDD
converged: YES YES NO NO
title: Mulliken charges:
elementType: C C C C C C C C C C C C C C H H H H H H H H H H H H H H H H H H
charge: 0.289471 0.289263 0.289466 0.289230 -0.539504 -0.539408 -0.539502 -0.539386 -0.411532 -0.411592 -0.411529 -0.411604 -0.590317 -0.589835 0.219432 0.213648 0.219415 0.213671 0.213645 0.219433 0.213675 0.219412 0.202851 0.204534 0.202846 0.204560 0.204532 0.202851 0.204563 0.202845 0.232442 0.232425
chargesum: 0.00000
title: Mulliken charges with hydrogens summed into heavy atoms:
elementType: C C C C C C C C C C C C C C
charge: 0.289471 0.289263 0.289466 0.289230 -0.106424 -0.106322 -0.106424 -0.106299 -0.004147 -0.004187 -0.004146 -0.004196 -0.357875 -0.357410
polarizability: 1.94202804e+02 -4.09910613e-04 1.46836071e+02 9.25074036e-04 2.03151644e+00 9.35658832e+01
1716.lowfreq: -23.3049 -0.0004 0.0002 0.0004 4.1949 7.5646 61.0536 86.3478 98.3357
frequency: 61.0535 86.3478 98.3013 185.3462 204.2074 206.4650 301.8725 301.9866 345.2940 353.2719 386.0774 428.2228 429.0015 458.6154 485.9851 542.3485 587.6266 622.4698 677.8294 703.0429 729.9926 736.3077 821.9458 822.9308 861.8191 863.5416 878.0682 901.4923 902.6425 924.8837 925.3123 936.5422 964.7113 992.9505 1081.4372 1084.0779 1089.1135 1092.8469 1104.8186 1131.7246 1133.1319 1161.3498 1161.4302 1188.8238 1198.2136 1240.3235 1245.4576 1246.3399 1246.8216 1260.5931 1279.9651 1295.8272 1326.0606 1331.2381 1336.4080 1342.9376 1344.0125 1347.4666 1356.1310 1377.6389 1412.9212 1451.1767 1452.3932 1456.0529 1456.9941 1470.7282 1471.3946 1475.2174 1475.6047 1507.5407 1579.9702 1622.9476 2951.8110 2952.1364 2952.3948 2952.8022 2975.4341 2975.6444 2975.6749 2975.7730 3013.0582 3013.3583 3015.2236 3015.7091 3035.6822 3036.1345 3044.2766 3044.4437 3086.7524 3090.6908
redmass: 2.9876 2.5245 2.2411 2.2839 3.9279 2.8519 2.1056 1.6830 2.8166 2.7373 3.7474 3.3163 2.3333 3.3067 2.2131 4.0949 4.0790 2.1201 2.6036 2.8358 5.0915 3.8241 1.5122 1.5109 1.3691 2.4905 2.3365 1.6638 1.4093 2.0815 2.5420 1.4403 2.6981 2.0871 1.9070 1.8574 1.8670 1.5946 2.2195 1.1479 1.1669 1.5171 1.3538 1.3971 5.2954 1.3474 1.4095 1.3967 1.2834 2.3161 1.1894 1.3330 1.5644 1.5246 1.5354 1.3871 1.4195 1.6375 1.7743 3.8563 5.0437 1.1486 1.1116 1.0817 1.0818 1.0850 1.0915 1.0946 1.0932 2.8065 6.7919 7.2466 1.0641 1.0644 1.0643 1.0644 1.0655 1.0605 1.0606 1.0657 1.0937 1.0938 1.0949 1.0949 1.0987 1.0984 1.1042 1.1042 1.0899 1.0906
irintensity: 0.5621 0.0026 0.0000 6.0773 0.6085 0.0000 0.0026 0.6647 0.0000 0.0000 0.0000 0.0005 10.8614 0.7423 0.2503 0.0000 0.1816 0.0000 0.7532 0.0000 0.0000 1.3427 0.0000 14.6047 8.6085 0.0013 4.3578 0.0000 0.0000 0.0001 8.3480 23.5632 0.0000 8.4008 0.0000 1.2552 0.0000 0.5201 0.0000 0.0000 3.0286 0.4178 0.0001 0.0546 2.5085 0.0001 0.0000 2.7238 13.0492 0.0000 0.0000 7.6941 0.0000 0.0000 0.0000 0.0000 1.9892 0.7270 0.0000 9.3127 1.9276 0.2879 0.0000 0.0000 30.1635 0.0002 21.5887 19.6933 0.0005 44.3230 0.0000 0.0000 0.0975 7.3716 117.5811 0.8569 84.6829 0.1983 56.4937 0.6317 0.0530 141.7701 7.0566 0.0378 158.7535 0.0065 0.0057 146.5649 46.0118 0.0007
temp: 298.150 k
press: 1.00000 atm
elementType: 6 6 6 6 6 6 6 6 6 6 6 6 6 6 1 1 1 1 1 1 1 1 1 1 1 1 1 1 1 1 1 1
symmnumber: 1
zpe: 739726.6 jmol-1
zpe.correction: 0.281747 hartree
zpe.thermalcorrener: 0.293599 hartree
zpe.thermalcorrenthalpy: 0.294544 hartree
zpe.thermalcorrgfe: 0.244116 hartree
zpe.sumelectzpe: -543.270505 hartree
zpe.sumelectthermal: -543.258653 hartree
zpe.sumelectthermalent: -543.257709 hartree
zpe.sumelectthermalfe: -543.308136 hartree
dipole: 0.0000 0.0007 0.0001
dipole: 0.0007
quadrupole: -78.1432 -80.2953 -86.6161
quadrupole: -0.0002 0.0002 0.5849
quadrupole: 3.5417 1.3896 -4.9313 -0.0002 0.0002 0.5849
hfenergy: -543.5522524 hartree
pointgroup: C01 [X(C14H18)]
dipole: -0.0000022 -0.000279 0.0000502 debye
polarizability: 194.202804|0.0002567|146.8119805|0.0008698|-2.3258933|93.5899736 unknown
InChI: InChI=1S/C14H18/c1-2-6-12-10-14-8-4-3-7-13(14)9-11(12)5-1/h9-10H,1-8H2
charge 0 multiplicity 1
32 atoms
C  -1.242331 0.710868 -0.038271
C  -1.242312 -0.710981 0.037906
C  1.242298 0.710902 -0.038247
C  1.242325 -0.710946 0.037875
C  -2.544432 1.507634 -0.109584
C  -2.544336 -1.507906 0.109358
C  2.544378 1.507716 -0.109397
C  2.544359 -1.507871 0.109184
C  -3.778199 0.69382 0.340375
C  -3.77864 -0.693902 -0.33884
C  3.778104 0.693898 0.340669
C  3.778693 -0.693738 -0.338714
C  -0.000027 1.386709 -0.07197
C  0.000014 -1.386777 0.0717
H  -2.449795 2.429955 0.496302
H  -2.70344 1.843621 -1.156378
H  -2.450071 -2.429555 -0.497624
H  -2.702383 -1.845092 1.155902
H  2.703512 1.843781 -1.156146
H  2.449635 2.429988 0.496546
H  2.702337 -1.845419 1.155619
H  2.450132 -2.429319 -0.498117
H  -3.760394 0.559361 1.440951
H  -4.703725 1.249349 0.095519
H  -3.762286 -0.559305 -1.439424
H  -4.703857 -1.249451 -0.092868
H  4.703653 1.249483 0.09603
H  3.760123 0.559324 1.44123
H  4.703895 -1.249292 -0.092703
H  3.762483 -0.558992 -1.439282
H  -0.000041 2.485088 -0.125878
H  0.000029 -2.485151 0.125777
