program: Orca
programVersion: 5.0.2
elementType: Cl P O O O O O N C C C C C C C C C C H H H H H H H H H H H H H H H H H H H
charge: 0
multiplicity: 1
keywords: wb97x-d3
keywords: def2-TZVPP
keywords: def2/J RIJCOSX
keywords: DEFGRID2
keywords: scfconv7
keywords: smallprint printgap noloewdin
keywords: NOSOSCF
formula: C10H19ClNO5P
InChI: InChI=1/C10H19ClNO5P/c1-6-12(7-2)10(13)9(11)8(3)17-18(14,15-4)16-5/h6-7H2,1-5H3
37 atoms
Cl -0.277429 -1.595434 1.722274
P  2.2336 -0.060277 -0.369655
O  1.411115 0.632899 0.83446
O  -2.906339 0.59905 1.874801
O  2.945787 1.214068 -1.003513
O  3.446865 -0.761737 0.379964
O  1.428149 -0.896266 -1.272232
N  -2.882582 -0.474992 -0.11773
C  -4.333446 -0.407386 -0.212427
C  -2.15638 -1.078534 -1.223129
C  -2.296315 0.053325 0.979185
C  -4.875423 0.958724 -0.608009
C  -2.134856 -0.222814 -2.480461
C  -0.802101 -0.092505 1.057135
C  0.060576 0.846331 0.690527
C  -0.312362 2.170314 0.119652
C  3.74716 1.076314 -2.171673
C  3.300812 -2.058996 0.952016
H  -4.640976 -1.156206 -0.944671
H  -4.763484 -0.706152 0.74449
H  -1.131314 -1.286099 -0.92873
H  -2.614632 -2.047199 -1.440125
H  -5.962187 0.91675 -0.688913
H  -4.627991 1.708637 0.140391
H  -4.483781 1.286947 -1.570389
H  -1.52448 -0.705737 -3.242854
H  -3.130645 -0.070839 -2.897776
H  -1.698737 0.755269 -2.277245
H  0.16032 2.970845 0.689966
H  0.030348 2.259606 -0.913621
H  -1.386468 2.335908 0.140396
H  4.6755 0.548198 -1.951023
H  3.987054 2.081318 -2.5101
H  3.213341 0.551156 -2.964384
H  2.809323 -1.995754 1.922466
H  4.302749 -2.461188 1.082873
H  2.729993 -2.722866 0.302516
totalener: -1625.15640906 hartree
nucrepener: 1848.26833447 hartree
electener: -3473.42474353 hartree
oneelecener: -5909.14351897 hartree
twoeener: 2435.71877544 hartree
kineticenergy: 1620.17129224 hartree
xcener: -115.234301789367 hartree
chargesum: -0.0000000
charge: -0.082493 0.877034 -0.340829 -0.386442 -0.326521 -0.323664 -0.516252 -0.103259 -0.053417 -0.077532 0.224656 -0.250052 -0.250994 0.077810 0.148610 -0.251243 -0.134006 -0.134457 0.079787 0.098566 0.111666 0.081054 0.088061 0.101686 0.072105 0.101937 0.082330 0.079666 0.115230 0.090165 0.100106 0.113539 0.115868 0.117152 0.114210 0.118611 0.121313
qa: -0.0825 0.8770 -0.3408 -0.3864 -0.3265 -0.3237 -0.5163 -0.1033 -0.0534 -0.0775 0.2247 -0.2501 -0.2510 0.0778 0.1486 -0.2512 -0.1340 -0.1345 0.0798 0.0986 0.1117 0.0811 0.0881 0.1017 0.0721 0.1019 0.0823 0.0797 0.1152 0.0902 0.1001 0.1135 0.1159 0.1172 0.1142 0.1186 0.1213
va: 1.2445 5.6427 2.1237 2.1169 2.1241 2.1178 2.0615 3.1252 3.8904 3.9224 4.2316 3.8975 3.9034 3.9593 3.8401 3.9923 3.8759 3.8588 0.9989 1.0115 1.0238 1.0021 1.0105 1.0141 1.0040 1.0137 1.0010 1.0039 1.0088 1.0027 1.0110 0.9906 0.9901 0.9928 0.9938 0.9921 0.9938
dispcorr: -0.020358046 hartree
energy: -1625.176767111238
dipole: -14.11944 14.94897 0.82953 6.16972 -6.31657 -0.14685 -18.66333 17.22767 -1.43566
magnitude: 1.66457 au
magnitude: 4.23101 debye
