program: Orca
programVersion: 5.0.2
elementType: Cl P O O O O O N C C C C C C C C C C H H H H H H H H H H H H H H H H H H H
charge: 0
multiplicity: 1
keywords: wb97x-d3
keywords: def2-TZVPP
keywords: def2/J RIJCOSX
keywords: DEFGRID2
keywords: scfconv7
keywords: smallprint printgap noloewdin
keywords: NOSOSCF
formula: C10H19ClNO5P
InChI: InChI=1/C10H19ClNO5P/c1-6-12(7-2)10(13)9(11)8(3)17-18(14,15-4)16-5/h6-7H2,1-5H3
37 atoms
Cl -0.456927 -1.664068 1.195586
P  2.817175 0.873144 -0.077421
O  1.407489 0.056893 -0.112195
O  -2.499481 1.302928 1.234564
O  3.767029 -0.275572 0.478322
O  3.270017 0.970694 -1.594397
O  2.777881 2.159656 0.617207
N  -3.17908 -0.398245 -0.085885
C  -4.562994 0.033172 0.035381
C  -2.89538 -1.420492 -1.076053
C  -2.236658 0.324205 0.566329
C  -4.915167 1.18045 -0.900596
C  -3.328989 -2.816507 -0.657737
C  -0.815434 -0.143116 0.448051
C  0.153817 0.590445 -0.098744
C  -0.057804 1.912301 -0.756679
C  3.63193 -0.73953 1.819932
C  3.445827 -0.166222 -2.430849
H  -5.198724 -0.829001 -0.172913
H  -4.754408 0.321138 1.068103
H  -3.396149 -1.142975 -2.009514
H  -1.82991 -1.417034 -1.299599
H  -4.348489 2.074811 -0.649101
H  -4.716103 0.926264 -1.942736
H  -5.975089 1.422319 -0.8194
H  -2.817696 -3.12841 0.250639
H  -4.403112 -2.876209 -0.48073
H  -3.090902 -3.531945 -1.445208
H  0.383405 2.712395 -0.163376
H  0.414239 1.927021 -1.740442
H  -1.112755 2.135538 -0.882088
H  2.683708 -1.259871 1.960076
H  3.70175 0.08284 2.532218
H  4.449674 -1.433377 1.997021
H  3.627395 0.209127 -3.434864
H  2.557396 -0.799923 -2.447601
H  4.301716 -0.761616 -2.114333
totalener: -1625.15467655 hartree
nucrepener: 1796.44120095 hartree
electener: -3421.59587750 hartree
oneelecener: -5805.16827394 hartree
twoeener: 2383.57239645 hartree
kineticenergy: 1620.15159831 hartree
xcener: -115.232886432601 hartree
chargesum: -0.0000000
charge: -0.095028 0.863640 -0.325291 -0.384162 -0.327963 -0.319619 -0.493068 -0.113933 -0.041208 -0.096247 0.240129 -0.247553 -0.212505 0.002015 0.154474 -0.228141 -0.121846 -0.125678 0.082533 0.095506 0.086121 0.104860 0.099598 0.065119 0.087920 0.083520 0.074159 0.081161 0.134409 0.095877 0.091555 0.110981 0.121687 0.112813 0.119488 0.106376 0.118305
qa: -0.0950 0.8636 -0.3253 -0.3842 -0.3280 -0.3196 -0.4931 -0.1139 -0.0412 -0.0962 0.2401 -0.2476 -0.2125 0.0020 0.1545 -0.2281 -0.1218 -0.1257 0.0825 0.0955 0.0861 0.1049 0.0996 0.0651 0.0879 0.0835 0.0742 0.0812 0.1344 0.0959 0.0916 0.1110 0.1217 0.1128 0.1195 0.1064 0.1183
va: 1.2291 5.6319 2.0760 2.1122 2.1060 2.1121 2.1331 3.1200 3.9005 3.9540 4.2419 3.9094 3.8904 3.8224 3.8801 3.9490 3.8626 3.8702 0.9984 1.0150 0.9951 0.9948 1.0133 1.0057 1.0102 1.0217 1.0082 1.0109 1.0131 1.0059 1.0162 0.9983 0.9923 0.9909 0.9894 0.9922 0.9940
dispcorr: -0.018499211 hartree
energy: -1625.173175762642
dipole: -20.49158 20.23726 -0.25432 -4.02177 2.19186 -1.82991 -12.60344 11.05599 -1.54745
magnitude: 2.40994 au
magnitude: 6.12559 debye
