program: Gaussian 09
title: 000002146
version: EM64L-G09RevD.01
frameworkgroup: C1[X(CH6N4)]
method: RPBEPBE
basis: SDD
operation: Freq
keyword: #p
keyword: freq=noraman
keyword: PBEPBE/SDD
title: #p freq=noraman PBEPBE/SDD
converged: NO YES NO NO
title: Mulliken charges:
elementType: N N N N C H H H H H H
charge: -0.624770 -0.620538 -0.207821 -0.645911 0.252851 0.318499 0.297945 0.294628 0.350929 0.291354 0.292833
chargesum: 0.00000
title: Mulliken charges with hydrogens summed into heavy atoms:
elementType: N N N N C
charge: -0.008326 0.025020 -0.207821 -0.061724 0.252851
polarizability: 5.76888753e+01 -2.96850419e+00 4.20400533e+01 -2.49030026e-01 -6.05871241e-01 2.52262947e+01
1716.lowfreq: -20.0108 -10.0394 -0.0003 0.0005 0.0006 13.5948 169.9649 250.7893 302.1768
frequency: 169.8695 250.7893 302.1759 353.0278 394.8099 442.7411 546.7090 591.0058 650.9711 774.9372 855.8697 911.4044 1004.6506 1054.6317 1159.1886 1192.7098 1470.4587 1538.5467 1586.5803 1622.1176 1652.2439 3363.9882 3417.6614 3473.9184 3533.9753 3646.4538 3679.4405
redmass: 1.1652 2.9401 2.4715 1.2543 1.4328 1.6180 1.3080 3.4036 3.4064 1.3548 6.3522 1.8641 2.0015 1.3989 1.9071 1.1561 2.8675 1.5684 1.6100 1.2529 1.5411 1.0439 1.0514 1.0958 1.0448 1.0941 1.1023
irintensity: 42.5797 22.3315 19.5003 83.2704 124.5866 109.0892 215.0608 14.1830 22.5207 210.9139 8.8801 64.9720 37.2633 9.5754 28.0128 0.2580 56.5791 125.2240 163.2613 124.3554 233.4022 1.6227 63.1202 0.4661 23.0299 37.0858 23.3861
temp: 298.150 k
press: 1.00000 atm
elementType: 7 7 7 7 6 1 1 1 1 1 1
symmnumber: 1
zpe: 237105.1 jmol-1
zpe.correction: 0.090309 hartree
zpe.thermalcorrener: 0.096410 hartree
zpe.thermalcorrenthalpy: 0.097354 hartree
zpe.thermalcorrgfe: 0.061724 hartree
zpe.sumelectzpe: -260.263678 hartree
zpe.sumelectthermal: -260.257577 hartree
zpe.sumelectthermalent: -260.256633 hartree
zpe.sumelectthermalfe: -260.292263 hartree
dipole: -1.2393 1.3819 0.0100
dipole: 1.8562
quadrupole: -20.0957 -29.4770 -31.7341
quadrupole: -0.3308 1.2739 1.1435
quadrupole: 7.0066 -2.3747 -4.6318 -0.3308 1.2739 1.1435
hfenergy: -260.353987 hartree
pointgroup: C01 [X(C1H6N4)]
dipole: -0.5071001 0.5096075 -0.1284229 debye
dipolederiv: -1.1761688 -0.2578835 0.2047016 -0.2038096 -0.4368664 -0.1581678 0.3213008 -0.1256248 -0.5714653 -0.4724981 0.0668108 -0.1357646 0.0924733 -1.0781183 0.2061669 -0.1631287 0.3119494 -0.6999638 -0.6492356 0.1751282 -0.0406657 0.4156632 -0.4668728 0.0565895 -0.0579673 0.0071881 -0.4166429 -0.3149395 -0.0818349 -0.0091567 -0.1495952 -0.4957076 0.0211531 -0.0239346 0.0255996 -0.0984538 1.5966882 0.0939129 0.0463667 -0.1542578 1.2676416 -0.2326883 0.1176992 -0.1275738 0.2228166 0.2442569 0.0547463 -0.0589311 -0.0104352 0.1517584 0.0402576 -0.0782186 0.0066288 0.3506954 0.2302487 -0.00659 -0.0721629 -0.049813 0.1927156 0.0973841 -0.2054472 0.0860282 0.2787521 0.1266094 0.0230284 0.0572244 0.0393071 0.1872014 0.0076529 0.104551 -0.0953313 0.3892288 0.3151295 -0.0788483 0.0236337 -0.0433511 0.2258069 -0.0215435 0.0158535 -0.0684886 0.3410604 0.0576172 -0.0126742 -0.0874092 0.0122008 0.2479887 0.1132664 -0.0743422 0.0615758 0.0710315 0.0422921 0.0242043 0.0721637 0.0516174 0.2044526 -0.1300708 0.0436342 -0.0819514 0.1329412 unknown
polarizability: 57.6693057|-1.785236|41.113198|3.0846621|-3.4468133|26.1727195 unknown
InChI: InChI=1S/CH6N4/c2-1(3)5-4/h2-4H2
charge 0 multiplicity 1
11 atoms
N  -1.75915 -0.557591 0.10645
N  -0.472427 1.415829 -0.209125
N  0.577917 -0.707642 0.243048
N  1.790935 0.169881 0.279554
C  -0.505962 0.05293 0.048317
H  -1.746318 -1.554037 0.319029
H  -2.515255 -0.204261 -0.476165
H  -1.270984 2.007977 0.004835
H  0.487696 1.781365 -0.15319
H  2.259474 -0.002122 1.183428
H  2.416772 -0.158429 -0.473181
