program: Gaussian 09
title: 000066171
version: EM64L-G09RevD.01
frameworkgroup: C1[X(C5H6N2)]
method: RPBEPBE
basis: SDD
operation: Freq
keyword: #p
keyword: freq=noraman
keyword: PBEPBE/SDD
title: #p freq=noraman PBEPBE/SDD
converged: NO NO NO NO
title: Mulliken charges:
elementType: N N C C C C C H H H H H H
charge: -0.143492 -0.093661 -0.166098 -0.182939 -0.321727 0.019175 -0.557369 0.260818 0.255338 0.254318 0.223677 0.226990 0.224970
chargesum: 0.00000
title: Mulliken charges with hydrogens summed into heavy atoms:
elementType: N N C C C C C
charge: -0.143492 -0.093661 0.094720 0.072400 -0.067409 0.242852 -0.105410
polarizability: 9.86918468e+01 -6.40452232e+00 6.47918479e+01 4.41278334e-04 3.06748044e-03 2.73133611e+01
1716.lowfreq: -11.3174 -9.0271 -0.0008 -0.0004 0.0006 18.4671 60.0855 216.1028 235.7103
frequency: 59.5623 216.1027 235.7101 486.6160 586.0140 639.6496 647.9655 704.2423 724.7506 773.8695 848.2887 874.2534 897.7712 970.1312 983.1228 1030.4019 1070.9992 1105.6898 1210.7263 1237.3345 1277.0868 1322.4765 1367.1637 1427.9075 1443.7714 1486.2144 1663.8056 3123.0584 3149.0085 3226.5517 3233.1810 3248.0303 3256.9448
redmass: 2.2368 2.6423 3.3401 3.3326 2.1943 3.1478 3.0706 1.7982 1.3055 1.5804 1.4166 6.2412 1.3570 1.1228 3.0422 1.7463 2.1412 1.5008 2.5342 1.5628 2.1237 2.3183 2.3335 1.4379 2.3501 4.2652 4.8286 1.0605 1.0956 1.0909 1.1140 1.0984 1.1093
irintensity: 0.4198 0.4150 0.9652 0.1841 18.3126 11.3126 6.2275 3.8312 26.4146 66.5590 3.7405 8.3086 102.6624 30.2118 23.1865 15.3387 5.2256 30.1266 54.7144 8.2821 48.0851 11.6859 12.1003 14.6202 59.9031 39.1092 122.7388 4.3233 6.9879 1.8273 11.4708 1.7564 2.4699
temp: 298.150 k
press: 1.00000 atm
elementType: 7 7 6 6 6 6 6 1 1 1 1 1 1
symmnumber: 1
zpe: 266339.0 jmol-1
zpe.correction: 0.101443 hartree
zpe.thermalcorrener: 0.107538 hartree
zpe.thermalcorrenthalpy: 0.108482 hartree
zpe.thermalcorrgfe: 0.071151 hartree
zpe.sumelectzpe: -303.084993 hartree
zpe.sumelectthermal: -303.078898 hartree
zpe.sumelectthermalent: -303.077954 hartree
zpe.sumelectthermalfe: -303.115285 hartree
dipole: 2.9769 2.2024 0.0006
dipole: 3.7031
quadrupole: -40.8139 -37.6036 -45.6195
quadrupole: -5.2843 -0.0014 0.0001
quadrupole: 0.5318 3.7421 -4.2738 -5.2843 -0.0014 0.0001
hfenergy: -303.1864361 hartree
pointgroup: C01 [X(C5H6N2)]
dipole: 1.1960869 -0.8318333 -0.0002541 debye
dipolederiv: -1.3038744 0.0304313 0.0000237 0.3336031 -0.1253201 -0.000113 0.0001796 -0.0000206 0.0288838 -0.7383605 0.0287487 -0.0000075 -0.1382647 -0.2713804 0.0000347 -0.0000762 -0.0000326 -0.2633557 0.5228911 0.0252833 0.0000415 0.2411119 -0.0752535 -0.0000203 -0.0000298 0.0000966 -0.1989343 0.5518371 -0.1603443 -0.0000977 -0.4610809 0.1144033 0.0000652 -0.0000377 0.0000768 -0.102724 -0.0207746 0.0972876 0.0000785 0.3589473 0.1198441 0.0000714 0.0000139 0.0000336 -0.1837803 1.2256903 0.0637138 -0.0000429 -0.1587744 0.19697 0.0000597 -0.0001059 0.0000151 -0.0579992 -0.4233129 -0.1005533 -0.0000317 -0.2726004 -0.0264385 0.0000806 0.0000004 0.0000934 -0.439053 0.0964415 0.0766004 -0.0000083 0.0211556 -0.0033065 -0.0000146 -0.0000079 -0.0000574 0.2362493 0.0416071 -0.0760085 0.0000207 -0.0478702 0.0502858 -0.0000177 -0.0000322 -0.0000607 0.1996617 -0.0202915 -0.0853085 -0.0000265 -0.0478605 0.0785092 -0.0000345 0.0000877 -0.0000363 0.1984589 0.0266033 -0.0218458 0.0000114 0.0647593 -0.0690719 -0.0000372 -0.0000324 -0.0000332 0.1751085 -0.0515224 0.0514612 0.0000238 0.0526188 0.0746591 -0.0000257 0.0000231 -0.000027 0.1939342 0.093066 0.070534 0.0000149 0.0542552 -0.0639006 -0.0000487 0.0000173 -0.0000475 0.2135501 unknown
polarizability: 98.2878589|7.3857898|65.1958358|-0.0005309|0.0030532|27.3133611 unknown
InChI: InChI=1S/C5H6N2/c1-2-7-4-3-6-5-7/h2-5H,1H2
charge 0 multiplicity 1
13 atoms
N  0.290173 -0.208624 0.000013
N  -1.677151 0.934852 0.000402
C  -0.743786 -1.16888 0.000081
C  -0.337518 1.048488 0.000104
C  -1.935902 -0.450993 -0.000139
C  1.677251 -0.511595 -0.000132
C  2.69338 0.385626 -0.000059
H  -0.535471 -2.235794 0.000065
H  0.211244 1.985717 0.000176
H  -2.953508 -0.833598 -0.000264
H  1.885314 -1.587192 -0.000298
H  3.724906 0.025531 -0.000178
H  2.542968 1.469462 0.000128
