program: Orca
programVersion: 5.0.2
elementType: O O O O O O O O O O O O N N N N N N N C C C C C C C C C C C C C C C C C C C C C H H H H H H H H H H H H H H H H H H H H H H H H H H H H H H H H H H H H H H H
charge: 0
multiplicity: 1
keywords: wb97x-d3
keywords: def2-TZVPP
keywords: def2/J RIJCOSX
keywords: DEFGRID2
keywords: scfconv7
keywords: smallprint printgap noloewdin
keywords: NOSOSCF
formula: C21H39N7O12
InChI: InChI=1/C21H39N7O12/c1-5-21(36,4-30)16(40-17-9(26-2)13(34)10(31)6(3-29)38-17)18(37-5)39-15-8(28-20(24)25)11(32)7(27-19(22)23)12(33)14(15)35/h4-18,26,29,31-36H,3,22-25H2,1-2H3
79 atoms
O  0.333588 -1.345757 0.335789
O  -0.980913 -2.263143 1.987567
O  -2.352694 0.012935 -0.280394
O  -2.271422 0.514307 -2.520028
O  -3.694796 -0.968909 1.871224
O  2.058562 -3.319004 1.462532
O  4.047937 1.698816 0.27688
O  4.748269 -2.973158 1.080673
O  -4.381422 3.587894 -0.772454
O  -1.785926 4.075526 -1.805167
O  -4.004067 -3.309852 -0.72361
O  0.18567 3.016777 -3.415454
N  1.17463 1.339499 0.733578
N  5.752163 -0.219294 1.014809
N  -4.967921 0.894118 -0.042473
N  1.7724 2.86797 -1.014051
N  0.20722 3.410763 0.607823
N  6.867022 -1.745956 -0.398687
N  8.020989 -0.097549 0.738424
C  -2.026832 -1.273324 0.141043
C  1.560201 -0.993445 0.955055
C  -3.108958 -1.906828 1.031005
C  -0.823041 -1.198034 1.078256
C  2.096969 0.305717 0.345938
C  2.500369 -2.176524 0.772526
C  3.513092 0.541363 0.86537
C  -2.23951 -2.899098 1.833155
C  3.897599 -1.868387 1.293816
C  4.448401 -0.64277 0.57747
C  -3.091593 0.173376 -1.448682
C  -4.128325 1.269742 -1.173045
C  -3.404577 2.587885 -0.926683
C  -2.467451 2.873727 -2.09357
C  -1.516983 1.690957 -2.305846
C  -2.796543 -3.28764 3.18258
C  -4.181073 -2.681665 0.28431
C  -0.615748 1.862844 -3.523658
C  1.079524 2.452905 0.135381
C  -6.167566 0.172247 -0.433108
C  6.809785 -0.708776 0.485532
H  -1.789073 -1.938916 -0.699492
H  1.4156 -0.819253 2.029937
H  -0.807445 -0.25195 1.63086
H  2.150334 0.169776 -0.747843
H  2.579637 -2.382177 -0.308596
H  3.457631 0.669072 1.958438
H  -2.110333 -3.803855 1.222069
H  3.836128 -1.64474 2.37023
H  4.427287 -0.841713 -0.508905
H  -3.582866 -0.758884 -1.749843
H  -4.732615 1.39332 -2.085154
H  -2.795234 2.495874 -0.013847
H  -3.079573 2.990719 -3.003354
H  -0.883516 1.573623 -1.416791
H  -3.745389 -3.813741 3.068291
H  -2.107247 -3.959535 3.69345
H  -2.960902 -2.414988 3.810373
H  -5.175896 -2.632053 0.77282
H  -4.039417 -0.234685 1.318918
H  1.102877 -3.394618 1.372537
H  -5.247188 1.734276 0.448434
H  4.994824 1.654185 0.479936
H  4.300188 -3.754464 1.420557
H  -0.011816 0.9556 -3.647894
H  -1.224687 1.970129 -4.425096
H  -3.931524 4.433892 -0.691199
H  -1.097266 4.168405 -2.482015
H  -6.744331 -0.085676 0.454314
H  -5.909058 -0.761336 -0.933427
H  -6.815285 0.738291 -1.1124
H  0.809103 2.878295 -2.674129
H  1.941004 3.865214 -0.980183
H  2.673056 2.407506 -1.079236
H  -0.365054 3.048644 1.353793
H  -0.348708 3.879397 -0.096129
H  6.191064 -2.482208 -0.266957
H  7.761614 -2.02494 -0.757901
H  8.803976 -0.708481 0.904134
H  7.943844 0.627698 1.432285
totalener: -2109.94625507 hartree
nucrepener: 5543.88700747 hartree
electener: -7653.83326254 hartree
twoeener: 6275.63393870 hartree
kineticenergy: 2101.26591236 hartree
xcener: -194.493938242482 hartree
chargesum: 0.0000000
charge: -0.335331 -0.347099 -0.327734 -0.340387 -0.411011 -0.381467 -0.396578 -0.370192 -0.349622 -0.419404 -0.288208 -0.399009 -0.375677 -0.475049 -0.316320 -0.317383 -0.293602 -0.311866 -0.277999 0.052190 0.127379 0.350959 0.201265 0.077307 0.069612 0.076409 0.110945 0.126673 0.107116 0.228186 0.076187 0.063403 0.058347 0.080642 -0.272910 0.005896 0.030227 0.223980 -0.211039 0.362708 0.097881 0.085905 0.067395 0.070116 0.069193 0.074252 0.081426 0.077862 0.070555 0.120259 0.085739 0.093774 0.094032 0.064720 0.072129 0.096522 0.094738 0.111281 0.207717 0.204658 0.127449 0.194955 0.187506 0.093858 0.084728 0.190783 0.211395 0.114695 0.096720 0.105258 0.210822 0.145296 0.180596 0.151394 0.164845 0.192898 0.120387 0.125692 0.149027
qa: -0.3353 -0.3471 -0.3277 -0.3404 -0.4110 -0.3815 -0.3966 -0.3702 -0.3496 -0.4194 -0.2882 -0.3990 -0.3757 -0.4750 -0.3163 -0.3174 -0.2936 -0.3119 -0.2780 0.0522 0.1274 0.3510 0.2013 0.0773 0.0696 0.0764 0.1109 0.1267 0.1071 0.2282 0.0762 0.0634 0.0583 0.0806 -0.2729 0.0059 0.0302 0.2240 -0.2110 0.3627 0.0979 0.0859 0.0674 0.0701 0.0692 0.0743 0.0814 0.0779 0.0706 0.1203 0.0857 0.0938 0.0940 0.0647 0.0721 0.0965 0.0947 0.1113 0.2077 0.2047 0.1274 0.1950 0.1875 0.0939 0.0847 0.1908 0.2114 0.1147 0.0967 0.1053 0.2108 0.1453 0.1806 0.1514 0.1648 0.1929 0.1204 0.1257 0.1490
va: 2.0066 2.0231 2.0065 2.1109 2.0415 2.0653 2.0373 2.0556 2.0818 2.0224 2.1553 2.0167 3.0088 2.9277 2.9747 3.0858 3.1155 3.1734 3.1136 3.9766 3.8645 3.5532 4.1448 3.9275 4.1073 3.9896 3.9435 3.8506 3.8233 4.1198 3.7947 3.9842 3.9287 3.8722 3.9703 4.0777 3.9287 4.3054 3.9349 4.2446 1.0508 1.0327 1.0435 1.0295 1.0305 1.0362 1.0117 1.0323 1.0453 0.9950 1.0308 1.0365 1.0224 1.0417 1.0080 1.0062 1.0224 1.0030 1.1168 1.0689 1.0400 1.0752 1.0547 0.9996 1.0027 1.0496 1.0781 0.9974 0.9847 1.0000 1.0971 1.0293 1.0666 1.0426 1.0679 1.0464 1.0477 1.0381 1.0433
dispcorr: -0.056105586 hartree
energy: -2110.002360653596
dipole: -4.87513 5.81550 0.94037 2.50177 -2.42227 0.07950 0.28729 -0.25367 0.03362
magnitude: 0.94432 au
magnitude: 2.40028 debye
