program: Gaussian 09
title: 000066238
version: EM64L-G09RevD.01
frameworkgroup: C1[X(C15H14Cl2O2)]
method: RPBEPBE
basis: SDD
operation: Freq
keyword: #p
keyword: freq=noraman
keyword: PBEPBE/SDD
title: #p freq=noraman PBEPBE/SDD
converged: YES YES NO NO
title: Mulliken charges:
elementType: Cl Cl O O C C C C C C C C C C C C C C C H H H H H H H H H H H H H H
charge: -0.025789 -0.069510 -0.406325 -0.410419 0.012247 0.496575 0.493081 -0.750889 -0.747360 -0.357105 -0.370752 -0.427239 -0.419273 -0.312370 -0.314105 -0.377323 -0.344870 0.364490 0.361777 0.212299 0.230247 0.238427 0.237037 0.211632 0.232701 0.272650 0.272819 0.251109 0.250325 0.221282 0.254273 0.361310 0.359045
chargesum: 0.00000
title: Mulliken charges with hydrogens summed into heavy atoms:
elementType: Cl Cl O O C C C C C C C C C C C C C C C
charge: -0.025789 -0.069510 -0.045015 -0.051374 0.012247 0.496575 0.493081 -0.069916 -0.065989 -0.084455 -0.097932 -0.176129 -0.168948 -0.312370 -0.314105 -0.156041 -0.090596 0.364490 0.361777
polarizability: 2.15728173e+02 -3.25881498e-01 1.79720876e+02 -2.40634997e+01 1.15436027e+00 1.67316296e+02
1716.lowfreq: -15.4369 -9.2545 -0.0011 0.0014 0.0020 2.9751 21.2004 24.9960 35.0369
frequency: 20.9050 24.4420 34.9355 100.0920 126.2076 136.7383 161.8896 163.2274 220.1964 237.1523 242.3571 261.6576 269.6178 281.6024 306.0141 308.6594 324.7672 349.9265 368.0343 370.9363 397.5651 432.5536 435.6162 448.3073 452.8744 469.3395 489.7365 501.6522 555.1568 600.8268 616.9377 638.9259 676.6816 696.7715 717.2747 724.8681 753.0329 801.2007 826.3924 830.6961 853.3638 884.8366 896.7107 928.0779 935.5318 938.2632 956.1920 1008.4490 1020.8210 1030.9926 1081.2514 1111.8343 1120.3974 1134.1808 1154.8324 1169.1166 1173.1303 1219.9827 1233.1194 1256.0319 1265.0328 1287.1532 1301.9831 1368.7963 1379.7992 1381.0797 1400.4991 1402.9845 1408.1427 1466.3328 1473.2608 1481.4729 1487.7723 1489.3705 1497.9184 1574.3717 1578.6103 1615.7663 1618.6142 2977.9504 2981.9552 3073.8066 3076.5157 3085.3025 3086.9519 3114.7632 3149.8743 3151.9532 3154.6799 3167.9889 3175.1668 3502.7191 3581.3532
redmass: 7.0166 8.4730 8.9637 4.2104 6.1618 6.1271 5.4646 6.1909 8.2193 4.6772 4.2490 4.6204 3.3515 1.5518 3.1263 1.9274 1.2740 1.1276 5.9816 3.9722 5.9765 3.0425 3.1271 1.2431 3.5322 4.3157 4.3624 3.9276 4.3587 3.9762 4.2345 5.6899 6.9295 7.0640 3.4323 3.5433 3.3394 1.4787 1.5357 5.0435 4.8494 1.4935 1.5118 1.7132 1.4907 1.6260 1.3845 1.3058 3.2203 3.3689 1.9357 1.8816 1.9750 1.7604 1.9780 1.2759 1.3724 2.3517 2.2257 2.6101 2.7737 1.4465 1.7154 4.3300 2.1993 1.5974 1.4837 2.8848 3.6674 1.0737 1.2117 1.7217 1.1062 1.2237 2.5211 6.5855 6.1692 7.4468 7.1082 1.0353 1.0359 1.0998 1.1000 1.0995 1.0997 1.0897 1.0917 1.0918 1.0874 1.0927 1.0962 1.0648 1.0661
irintensity: 0.0261 0.8728 0.0687 0.4293 0.0896 0.2521 0.6661 0.4376 1.6414 2.6742 3.5394 2.9805 0.7935 2.0935 3.0557 2.0721 1.7457 131.2965 1.1818 1.1158 0.7836 23.7500 10.5708 118.3884 6.4939 9.3957 10.6750 12.2411 3.8665 17.8242 20.9491 1.5788 25.4486 31.6173 9.9379 4.8599 25.0956 38.5364 24.5927 2.8078 17.2729 12.0533 11.3638 14.1926 6.3561 8.4619 0.3093 2.8013 20.5566 37.5834 22.8706 57.2866 118.6518 27.5439 36.2489 13.1696 250.1185 14.9379 45.6402 59.9158 70.1475 10.0866 15.6400 40.7041 22.4275 17.4385 6.8059 7.4947 8.6439 9.0129 28.2738 79.6589 9.7641 62.4145 114.3790 12.6764 5.7877 16.5494 5.8609 23.6127 26.0182 15.2545 45.5996 43.3026 33.9181 17.9208 1.3661 1.0854 5.4782 8.2930 6.8878 59.3121 50.7355
temp: 298.150 k
press: 1.00000 atm
elementType: 17 17 8 8 6 6 6 6 6 6 6 6 6 6 6 6 6 6 6 1 1 1 1 1 1 1 1 1 1 1 1 1 1
symmnumber: 1
zpe: 653417.2 jmol-1
zpe.correction: 0.248873 hartree
zpe.thermalcorrener: 0.267128 hartree
zpe.thermalcorrenthalpy: 0.268072 hartree
zpe.thermalcorrgfe: 0.201552 hartree
zpe.sumelectzpe: -1649.183356 hartree
zpe.sumelectthermal: -1649.165101 hartree
zpe.sumelectthermalent: -1649.164157 hartree
zpe.sumelectthermalfe: -1649.230677 hartree
dipole: 0.9559 3.2276 -2.7160
dipole: 4.3252
quadrupole: -125.3516 -123.8182 -119.5246
quadrupole: 5.7552 -13.7343 3.7853
quadrupole: -2.4535 -0.9201 3.3735 5.7552 -13.7343 3.7853
hfenergy: -1649.4322293 hartree
pointgroup: C01 [X(C15H14Cl2O2)]
dipole: -0.4234113 1.2980337 1.0156186 debye
polarizability: 218.3579508|-0.5151722|179.6681428|-21.100852|-1.2414642|164.7392517 unknown
InChI: InChI=1S/C15H14Cl2O2/c1-15(2,9-3-5-13(18)11(16)7-9)10-4-6-14(19)12(17)8-10/h3-8,18-19H,1-2H3
charge 0 multiplicity 1
33 atoms
Cl -3.001739 -2.228249 -1.886418
Cl 2.950517 -2.333381 1.87756
O  -4.713394 -1.599861 0.483087
O  4.75028 -1.595592 -0.503766
C  0.017019 1.74311 -0.005375
C  -1.24114 0.862207 0.200252
C  1.263583 0.838987 -0.186982
C  0.285338 2.67441 1.213454
C  -0.234867 2.64653 -1.248549
C  -1.528539 -0.150661 -0.755436
C  1.499018 -0.194462 0.759446
C  -2.150265 1.034401 1.270448
C  2.217665 1.019617 -1.22052
C  -2.676715 -0.946688 -0.643271
C  2.644347 -0.99201 0.656663
C  -3.30631 0.229964 1.385068
C  3.367485 0.207616 -1.316527
C  -3.587899 -0.771525 0.42759
C  3.602011 -0.815539 -0.372711
H  -0.540623 3.395106 1.358781
H  0.420326 2.09963 2.147174
H  1.210614 3.251041 1.039042
H  -1.158029 3.23292 -1.096461
H  0.596433 3.358542 -1.403761
H  -0.363374 2.050991 -2.16976
H  -0.839068 -0.330672 -1.586729
H  0.777403 -0.383003 1.560613
H  -1.970113 1.797199 2.032877
H  2.072727 1.799107 -1.973865
H  -3.995311 0.380841 2.226489
H  4.099533 0.345757 -2.117683
H  -5.26503 -1.387746 1.276732
H  4.781117 -2.279088 0.217636
