program: Orca
programVersion: 5.0.2
elementType: N N N C C C C C C C C C C C C H H H H H H H H H H H H H
charge: 0
multiplicity: 1
keywords: wb97x-d3
keywords: def2-TZVPP
keywords: def2/J RIJCOSX
keywords: DEFGRID2
keywords: scfconv7
keywords: smallprint printgap noloewdin
keywords: NOSOSCF
formula: C12H13N3
InChI: InChI=1/C12H13N3/c1-9-8-10(2)14-12(13-9)15-11-6-4-3-5-7-11/h3-8,15H,1-2H3
28 atoms
N  -0.69396 -0.882841 0.002999
N  1.420694 -1.687344 0.012913
N  1.052757 0.657732 -0.009616
C  0.639605 -0.598688 0.001068
C  -1.819955 -0.068097 -0.000922
C  2.727604 -1.484978 0.015954
C  2.372778 0.860651 -0.005353
C  3.261261 -0.196419 0.008785
C  -3.057938 -0.72427 0.033179
C  -1.807589 1.328692 -0.0392
C  3.627178 -2.676091 0.028868
C  2.837751 2.27807 -0.030368
C  -4.242066 -0.010128 0.02835
C  -3.006142 2.031137 -0.043323
C  -4.228743 1.379253 -0.010511
H  -0.887686 -1.873397 0.019013
H  4.330152 -0.034212 0.014232
H  -3.085842 -1.807588 0.064145
H  -0.874127 1.864916 -0.064892
H  3.061684 -3.604993 0.033825
H  4.2809 -2.672264 -0.844406
H  4.273933 -2.658657 0.907142
H  2.339887 2.864409 0.742032
H  3.913148 2.352348 0.115402
H  2.593463 2.738986 -0.989302
H  -5.181817 -0.546507 0.055244
H  -2.971885 3.112829 -0.07342
H  -5.153756 1.939973 -0.014613
elementType: N C H
totalener: -629.44385837 hartree
nucrepener: 910.94879303 hartree
electener: -1540.39265140 hartree
oneelecener: -2658.82344635 hartree
twoeener: 1118.43079495 hartree
cpcmener: -0.01919534 hartree
kineticenergy: 626.64734631 hartree
xcener: -62.438350599939 hartree
chargesum: -0.0000000
charge: -0.134998 -0.423705 -0.427618 0.436814 0.206389 0.158160 0.169571 -0.211536 -0.241425 -0.260056 -0.237868 -0.245469 -0.120435 -0.146107 -0.212212 0.156492 0.140768 0.141433 0.161968 0.090843 0.108146 0.108129 0.100837 0.099504 0.106098 0.158907 0.157768 0.159600
qa: -0.1350 -0.4237 -0.4276 0.4368 0.2064 0.1582 0.1696 -0.2115 -0.2414 -0.2601 -0.2379 -0.2455 -0.1204 -0.1461 -0.2122 0.1565 0.1408 0.1414 0.1620 0.0908 0.1081 0.1081 0.1008 0.0995 0.1061 0.1589 0.1578 0.1596
va: 3.1719 3.0204 3.0053 4.0832 3.7925 3.9234 3.8791 3.8674 3.9209 3.9007 3.9133 3.9258 3.8871 3.9072 3.9035 1.0361 0.9965 1.0078 1.0462 1.0225 0.9967 0.9968 1.0059 1.0058 1.0012 0.9894 0.9923 0.9903
dispcorr: -0.009257918 hartree
energy: -629.453116283204
dipole: 6.28455 -5.14170 1.14285 1.53998 -1.79536 -0.25537 -0.02665 0.02472 -0.00193
magnitude: 1.17104 au
magnitude: 2.97654 debye
