program: Orca
programVersion: 5.0.2
elementType: N N N C C C C C C C C C C C C H H H H H H H H H H H H H
charge: 0
multiplicity: 1
keywords: wb97x-d3
keywords: def2-TZVPP
keywords: def2/J RIJCOSX
keywords: DEFGRID2
keywords: scfconv7
keywords: smallprint printgap noloewdin
keywords: NOSOSCF
formula: C12H13N3
InChI: InChI=1/C12H13N3/c1-9-8-10(2)14-12(13-9)15-11-6-4-3-5-7-11/h3-8,15H,1-2H3
28 atoms
N  -0.68427 -0.880156 -0.006874
N  1.427962 -1.677746 -0.003367
N  1.05872 0.665713 -0.001445
C  0.647259 -0.593741 -0.003688
C  -1.815038 -0.070898 -0.003206
C  2.732996 -1.474983 0.000629
C  2.371296 0.868578 0.002466
C  3.266697 -0.188638 0.004027
C  -3.051013 -0.726139 0.003517
C  -1.797603 1.324644 -0.006093
C  3.605819 -2.689557 0.002749
C  2.825373 2.293116 0.004537
C  -4.234269 -0.012433 0.007526
C  -2.99445 2.025402 -0.001905
C  -4.217346 1.374863 0.004945
H  -0.856896 -1.872363 -0.007421
H  4.334561 -0.023529 0.007526
H  -3.083966 -1.810176 0.005944
H  -0.858011 1.851225 -0.011245
H  3.405521 -3.297019 0.885453
H  3.392538 -3.310237 -0.867457
H  4.66295 -2.431381 -0.006393
H  3.910303 2.375875 0.019039
H  2.450252 2.809392 -0.879442
H  2.425574 2.815389 0.87394
H  -5.174867 -0.547514 0.012842
H  -2.960706 3.10734 -0.004157
H  -5.141331 1.936725 0.008225
totalener: -629.43355578 hartree
nucrepener: 911.88118977 hartree
electener: -1541.31474556 hartree
oneelecener: -2659.98872379 hartree
twoeener: 1118.67397823 hartree
kineticenergy: 626.67496153 hartree
xcener: -62.441589044304 hartree
chargesum: -0.0000000
charge: -0.148515 -0.386903 -0.390158 0.433709 0.200051 0.139070 0.156987 -0.164644 -0.205354 -0.196933 -0.229815 -0.239338 -0.096187 -0.099134 -0.162111 0.131157 0.100906 0.092806 0.143582 0.098609 0.098696 0.080644 0.084075 0.099729 0.099688 0.119449 0.119321 0.120614
qa: -0.1485 -0.3869 -0.3902 0.4337 0.2001 0.1391 0.1570 -0.1646 -0.2054 -0.1969 -0.2298 -0.2393 -0.0962 -0.0991 -0.1621 0.1312 0.1009 0.0928 0.1436 0.0986 0.0987 0.0806 0.0841 0.0997 0.0997 0.1194 0.1193 0.1206
va: 3.1861 3.0378 3.0398 4.0727 3.8844 3.9577 3.9181 3.9028 3.9829 3.9572 3.9575 3.9309 3.9921 3.9451 3.9722 1.0561 1.0059 1.0183 1.0497 1.0065 1.0070 1.0089 1.0098 1.0059 1.0063 1.0010 1.0020 1.0015
dispcorr: -0.009247155 hartree
energy: -629.442802937966
dipole: 6.12271 -5.34405 0.77866 1.45134 -1.58159 -0.13026 0.03085 -0.02732 0.00353
magnitude: 0.78949 au
magnitude: 2.00672 debye
