program: Gaussian 09
title: 000066182
version: EM64L-G09RevD.01
frameworkgroup: C1[X(C16H18)]
method: RPBEPBE
basis: SDD
operation: Freq
keyword: #p
keyword: freq=noraman
keyword: PBEPBE/SDD
title: #p freq=noraman PBEPBE/SDD
converged: YES YES NO NO
title: Mulliken charges:
elementType: C C C C C C C C C C C C C C C C H H H H H H H H H H H H H H H H H H
charge: -0.369195 -0.369177 -0.570261 -0.570283 0.505663 0.505664 -0.414246 -0.414378 -0.414395 -0.414251 -0.229088 -0.229042 -0.229012 -0.229064 -0.244638 -0.244637 0.209364 0.209475 0.209490 0.209352 0.207083 0.207041 0.207095 0.207032 0.230590 0.230603 0.230607 0.230595 0.222298 0.222295 0.222281 0.222285 0.226426 0.226426
chargesum: 0.00000
title: Mulliken charges with hydrogens summed into heavy atoms:
elementType: C C C C C C C C C C C C C C C C
charge: 0.049644 0.049664 -0.156138 -0.156156 0.505663 0.505664 -0.183655 -0.183775 -0.183788 -0.183656 -0.006789 -0.006747 -0.006731 -0.006778 -0.018212 -0.018212
polarizability: 2.33993205e+02 4.42568288e-03 1.66085796e+02 2.86405576e+01 -7.96745569e-03 9.67480615e+01
1716.lowfreq: -13.4945 -4.5552 -0.0006 -0.0005 -0.0002 1.9365 17.7698 26.0477 29.7252
frequency: 17.7692 26.0475 26.3103 39.1635 77.3907 94.8562 108.7601 189.5616 202.5168 329.5257 332.2260 337.5764 338.3319 402.3959 402.4458 494.2662 514.5892 571.2545 592.6694 617.6245 617.6256 705.5495 706.2145 738.5285 758.2199 759.7770 782.0448 809.4319 810.1997 852.5716 853.2910 892.5168 914.0462 919.0425 975.0934 975.1565 989.4381 989.7308 992.6705 992.9450 1002.9869 1025.8505 1026.9912 1031.9081 1043.2996 1061.1179 1062.7240 1099.6568 1120.3458 1171.2449 1171.3061 1186.1337 1186.3060 1216.4940 1216.6830 1230.7252 1234.4692 1280.7585 1283.0193 1293.7950 1326.1832 1327.1832 1329.8023 1344.6597 1382.1567 1382.1688 1440.2317 1440.2586 1464.9909 1466.6531 1478.2247 1482.6316 1483.1090 1488.2207 1592.3142 1592.3432 1614.1741 1614.8296 2964.2523 2968.2105 2977.7091 2982.1592 3003.6125 3019.0518 3038.3673 3053.3590 3112.6011 3112.6742 3112.6884 3112.7279 3129.9846 3130.0056 3141.4235 3141.4807 3160.7380 3160.8327
redmass: 3.9465 3.7691 3.0243 4.5060 5.1539 2.4199 1.8759 4.1498 4.9865 2.2918 3.6092 2.3627 3.7971 2.8218 2.8216 3.6129 2.9751 5.2984 3.8011 6.3548 6.3549 1.7725 1.7099 1.0765 2.1687 1.8351 1.2086 3.2845 4.3148 1.2479 1.2467 1.3655 1.4341 1.4773 1.3867 1.3864 5.9956 6.2834 1.3761 1.3119 3.8922 2.2060 2.1541 1.6121 5.5488 2.5465 1.4612 1.4368 1.1695 1.0523 1.0517 1.1154 1.1160 2.3844 2.2379 1.3581 1.4101 1.2258 1.0628 1.4564 1.2601 1.2469 1.4153 1.5331 7.7471 7.9380 2.1838 2.1782 1.0775 1.1063 1.1272 2.2845 2.2240 1.1063 6.0410 6.0307 6.2049 6.1997 1.0590 1.0589 1.0596 1.0588 1.0986 1.1018 1.1045 1.1049 1.0879 1.0869 1.0867 1.0861 1.0906 1.0906 1.0958 1.0958 1.1014 1.1014
irintensity: 0.0201 0.0048 0.0000 0.0191 0.0000 0.1337 0.0001 3.0356 0.0000 0.2280 0.0000 0.0006 0.0715 0.0001 0.0000 20.8669 0.0001 0.0000 18.6482 0.0205 0.1086 0.0004 109.5165 4.3482 79.4696 0.0004 0.0008 12.2920 0.0005 0.0005 0.0000 0.1171 0.0000 4.9537 0.0000 0.0391 0.1374 0.0000 0.2866 0.0000 0.2525 0.0000 17.1204 0.0005 0.0002 0.0020 12.0227 0.0002 10.6277 0.0000 0.2024 0.3399 0.0000 0.0005 0.2743 21.0981 0.0444 0.5490 0.0001 0.0001 0.0000 0.1563 3.8624 0.0000 0.2523 0.0032 0.0012 12.7722 0.0000 1.1135 0.0000 42.2268 0.0004 21.2149 0.0040 2.8774 27.2683 0.0000 0.0000 3.0623 0.0005 131.9762 0.0002 0.0970 0.0003 90.6066 1.3420 17.4463 17.8898 1.8811 20.7844 0.0252 0.1882 96.3619 52.4505 0.0141
temp: 298.150 k
press: 1.00000 atm
elementType: 6 6 6 6 6 6 6 6 6 6 6 6 6 6 6 6 1 1 1 1 1 1 1 1 1 1 1 1 1 1 1 1 1 1
symmnumber: 1
zpe: 761226.9 jmol-1
zpe.correction: 0.289936 hartree
zpe.thermalcorrener: 0.304701 hartree
zpe.thermalcorrenthalpy: 0.305645 hartree
zpe.thermalcorrgfe: 0.244156 hartree
zpe.sumelectzpe: -619.350871 hartree
zpe.sumelectthermal: -619.336106 hartree
zpe.sumelectthermalent: -619.335162 hartree
zpe.sumelectthermalfe: -619.396651 hartree
dipole: 0.0000 -0.0006 0.0000
dipole: 0.0006
quadrupole: -94.1538 -85.9475 -102.1572
quadrupole: 0.0011 5.3792 -0.0036
quadrupole: -0.0677 8.1387 -8.0710 0.0011 5.3792 -0.0036
hfenergy: -619.6408073 hartree
pointgroup: C01 [X(C16H18)]
dipole: 0.0000008 -0.0002532 0.0000065 debye
polarizability: 233.7546909|-0.1366717|166.0852671|29.205109|0.1976772|96.9871044 unknown
InChI: InChI=1S/C16H18/c1-3-9-15(10-4-1)13-7-8-14-16-11-5-2-6-12-16/h1-6,9-12H,7-8,13-14H2
charge 0 multiplicity 1
34 atoms
C  -0.736489 -0.00515 -0.231263
C  0.73653 -0.008439 0.230783
C  -1.737479 -0.011465 0.958576
C  1.737578 -0.006441 -0.959023
C  -3.18794 -0.006191 0.498638
C  3.187989 -0.006541 -0.498881
C  -3.872166 1.214819 0.262476
C  3.874252 1.211721 -0.254659
C  -3.876815 -1.221689 0.248251
C  3.874737 -1.224836 -0.256279
C  -5.202516 1.22353 -0.214038
C  5.204519 1.215004 0.222178
C  -5.207204 -1.21956 -0.228287
C  5.205007 -1.228134 0.220557
C  -5.875534 0.004667 -0.462785
C  5.87538 -0.006595 0.46316
H  -0.930603 -0.888481 -0.873067
H  -0.929717 0.885776 -0.862722
H  0.931349 0.876734 0.869806
H  0.929043 -0.89755 0.865038
H  -1.53725 -0.905468 1.581484
H  -1.534537 0.873729 1.593083
H  1.536322 -0.895256 -1.588981
H  1.535739 0.883984 -1.586521
H  -3.358472 2.164683 0.459105
H  3.362273 2.163744 -0.445211
H  -3.366924 -2.175837 0.433666
H  3.363219 -2.176856 -0.448057
H  -5.714935 2.177098 -0.386613
H  5.718558 2.166535 0.401068
H  -5.723354 -2.169028 -0.412033
H  5.719476 -2.179668 0.398217
H  -6.908228 0.008726 -0.829463
H  6.907989 -0.006664 0.830099
