program: Orca
programVersion: 5.0.2
elementType: O O O O O O O O O N N C C C C C C C C C C C C C C C C C C C C C C H H H H H H H H H H H H H H H H H H H H H H H H
charge: 0
multiplicity: 1
keywords: wb97x-d3
keywords: def2-TZVPP
keywords: def2/J RIJCOSX
keywords: DEFGRID2
keywords: scfconv7
keywords: smallprint printgap noloewdin
keywords: NOSOSCF
formula: C22H24N2O9
InChI: InChI=1/C22H24N2O9/c1-21(32)7-5-4-6-8(25)9(7)15(26)10-12(21)17(28)13-14(24(2)3)16(27)11(20(23)31)19(30)22(13,33)18(10)29/h4-6,12-14,17,25-26,28,30,32-33H,23H2,1-3H3
57 atoms
O  -0.34835 2.933731 1.40828
O  1.149758 2.508889 -0.956965
O  -2.11298 -0.76447 1.630683
O  0.87822 -0.381761 -2.211572
O  3.426824 1.520343 -1.666876
O  -1.39163 -1.260688 -2.541481
O  2.961805 -2.137476 1.211229
O  -3.849223 -1.56298 -3.3323
O  5.328499 0.051136 -1.449445
N  1.49157 -0.384516 2.938895
N  5.278882 -1.784336 -0.159054
C  1.12596 1.055114 1.005653
C  -1.395481 1.090435 0.339061
C  -0.298166 1.511504 1.347417
C  1.39026 1.206876 -0.48531
C  1.40585 -0.372629 1.4862
C  -2.595775 0.431074 1.036593
C  -0.897681 0.229175 -0.792446
C  0.44831 0.270437 -1.240725
C  2.813581 0.812502 -0.780901
C  -3.64275 0.036667 -0.0067
C  2.629201 -1.020281 0.827699
C  -1.789469 -0.529485 -1.516005
C  3.382267 -0.284496 -0.165725
C  -3.177335 1.362915 2.09396
C  -3.209663 -0.529338 -1.225347
C  -4.994465 0.110029 0.26422
C  2.76591 0.035896 3.485522
C  0.999959 -1.58325 3.585911
C  -4.158916 -1.017224 -2.146766
C  4.722901 -0.678033 -0.622698
C  -5.923714 -0.362996 -0.660342
C  -5.518377 -0.924582 -1.849239
H  1.818238 1.725149 1.529689
H  -1.780388 2.019268 -0.100041
H  -0.521448 1.095674 2.331589
H  0.558773 -1.009249 1.208572
H  -2.422523 1.655594 2.821391
H  -3.973804 0.875736 2.656996
H  -3.585749 2.269138 1.647616
H  0.211423 3.225181 2.138623
H  0.705876 3.016575 -0.258481
H  -2.820212 -1.148057 2.162711
H  -5.355317 0.533897 1.18908
H  3.125388 0.940291 2.993411
H  2.64435 0.275379 4.542995
H  3.556655 -0.722094 3.414754
H  1.677472 -2.442839 3.528017
H  0.830786 -1.37699 4.644678
H  0.043161 -1.876445 3.155371
H  4.362785 1.07899 -1.757784
H  -0.399933 -1.089999 -2.662967
H  -6.980272 -0.291956 -0.438093
H  -6.240496 -1.296106 -2.564746
H  4.766664 -2.38373 0.471078
H  6.197907 -2.050375 -0.477613
H  -2.884699 -1.615931 -3.437547
elementType: O N C H
totalener: -1639.56633058 hartree
nucrepener: 3824.45659550 hartree
electener: -5464.02292607 hartree
oneelecener: -9851.56924807 hartree
twoeener: 4387.54632200 hartree
cpcmener: -0.06911916 hartree
kineticenergy: 1632.76188685 hartree
xcener: -152.549221105690 hartree
chargesum: 0.0000000
charge: -0.426592 -0.450502 -0.409357 -0.485835 -0.349871 -0.363896 -0.507265 -0.372232 -0.521828 -0.242792 -0.231583 0.117167 0.150224 -0.046355 0.634542 -0.045469 0.551956 -0.392030 0.159590 0.197617 -0.187469 0.261489 0.256166 -0.245163 -0.385366 -0.099239 -0.161474 -0.211843 -0.193039 0.247871 0.338695 -0.113035 -0.214793 0.119333 0.096641 0.104719 0.132027 0.113872 0.109271 0.116686 0.232606 0.250405 0.222243 0.150420 0.106761 0.110514 0.085574 0.082856 0.103960 0.093325 0.277519 0.259446 0.160681 0.141738 0.220381 0.192457 0.258277
qa: -0.4266 -0.4505 -0.4094 -0.4858 -0.3499 -0.3639 -0.5073 -0.3722 -0.5218 -0.2428 -0.2316 0.1172 0.1502 -0.0464 0.6345 -0.0455 0.5520 -0.3920 0.1596 0.1976 -0.1875 0.2615 0.2562 -0.2452 -0.3854 -0.0992 -0.1615 -0.2118 -0.1930 0.2479 0.3387 -0.1130 -0.2148 0.1193 0.0966 0.1047 0.1320 0.1139 0.1093 0.1167 0.2326 0.2504 0.2222 0.1504 0.1068 0.1105 0.0856 0.0829 0.1040 0.0933 0.2775 0.2594 0.1607 0.1417 0.2204 0.1925 0.2583
va: 1.9930 2.0133 2.0233 2.0329 2.2081 2.1669 1.9851 2.1344 1.9943 2.8849 3.2925 3.9259 3.5303 4.0623 3.7475 3.9513 3.7350 3.5773 4.0152 3.9003 3.8795 3.9284 3.9561 3.4123 3.9876 3.6110 3.8712 3.9387 3.9276 3.9361 4.2788 3.9597 3.9546 1.0297 1.0341 1.0549 1.0098 1.0017 1.0006 1.0008 1.0032 1.0426 1.0078 1.0017 0.9951 0.9951 1.0039 1.0077 0.9909 1.0083 1.0712 1.0787 0.9891 1.0102 1.0249 1.0067 1.0320
dispcorr: -0.038255169 hartree
energy: -1639.604585744073
dipole: -5.63442 3.61752 -2.01690 1.53030 -1.13135 0.39894 27.39322 -23.65032 3.74289
magnitude: 4.27040 au
magnitude: 10.85449 debye
