program: Gaussian 09
title: 000066180
version: EM64L-G09RevD.01
frameworkgroup: C1[X(C12H10ClP)]
method: RPBEPBE
basis: SDD
operation: Freq
keyword: #p
keyword: freq=noraman
keyword: PBEPBE/SDD
title: #p freq=noraman PBEPBE/SDD
converged: YES YES NO NO
title: Mulliken charges:
elementType: Cl P C C C C C C C C C C C C H H H H H H H H H H
charge: -0.232252 0.486967 -0.215687 -0.215761 -0.166609 -0.259033 -0.247010 -0.227668 -0.235089 -0.215464 -0.212229 -0.231743 -0.219639 -0.226859 0.258291 0.241604 0.245082 0.272539 0.233273 0.232407 0.234333 0.233843 0.234037 0.232667
chargesum: 0.00000
title: Mulliken charges with hydrogens summed into heavy atoms:
elementType: Cl P C C C C C C C C C C C C
charge: -0.232252 0.486967 -0.215687 -0.215761 0.091682 -0.017429 -0.001928 0.044871 -0.001816 0.016943 0.022104 0.002100 0.014398 0.005809
polarizability: 2.06497282e+02 5.68451566e+00 1.44570375e+02 1.14949356e+01 1.30380850e+00 1.26172506e+02
1716.lowfreq: -3.7949 -0.0017 -0.0017 -0.0012 6.6459 11.4675 15.9336 34.2086 57.9198
frequency: 12.7193 34.0147 57.9027 85.2609 129.0871 193.4605 203.8537 245.0588 252.1305 388.4218 391.7784 397.8971 407.3747 422.1146 486.2983 504.0023 611.2157 612.3754 671.8846 679.1647 697.3503 700.9982 756.1625 758.9402 856.2508 859.6707 929.1374 936.2066 981.4856 984.4364 985.2285 986.9917 1001.5045 1004.1923 1017.5551 1019.0850 1073.1106 1078.1805 1080.3413 1082.9583 1174.4036 1174.5177 1192.1554 1193.8080 1306.8690 1309.7649 1372.5454 1377.0358 1420.7880 1424.0051 1463.2823 1464.3023 1580.5664 1582.0867 1591.2828 1592.5394 3118.1636 3124.4213 3130.0181 3131.1099 3141.9268 3143.1068 3153.1108 3154.5577 3166.3373 3167.1612
redmass: 4.1563 3.8395 5.6108 8.5794 9.1295 4.7859 4.9275 5.0153 7.5888 7.4753 3.0941 2.9710 8.5609 9.5935 3.9449 4.0227 6.4619 6.4652 6.7444 6.8437 1.9601 2.0561 1.5971 1.6233 1.2461 1.2446 1.3606 1.3640 1.3866 5.9299 1.5839 4.2000 1.3179 1.3291 3.4816 3.3623 2.3279 1.9116 1.7600 1.9883 1.0533 1.0549 1.1215 1.1207 1.3504 1.3373 7.1202 7.6116 2.1229 2.1371 2.0162 2.0122 5.8012 5.8712 5.8622 5.8784 1.0876 1.0863 1.0865 1.0875 1.0913 1.0916 1.0958 1.0960 1.1016 1.1016
irintensity: 0.3102 0.0235 0.6186 1.2656 2.4638 1.2495 2.2175 0.2811 3.6589 19.9315 4.3123 1.1997 15.6583 20.2132 29.6690 32.9331 0.2693 0.4336 1.6293 4.2169 43.2279 49.2691 51.7281 54.1497 0.2651 0.0729 2.3307 0.5499 0.1691 3.5656 0.1564 2.3267 0.0730 0.1182 1.5698 3.0096 33.3734 13.6091 7.2068 6.7645 0.0134 0.1185 11.0433 0.7558 4.9171 4.5432 0.1148 0.3158 13.2008 19.5448 3.4889 16.5954 0.0403 0.6069 2.4180 3.0267 2.4710 0.8500 1.0551 0.5951 8.8365 11.3985 14.5056 23.4284 44.6477 22.5523
temp: 298.150 k
press: 1.00000 atm
elementType: 17 15 6 6 6 6 6 6 6 6 6 6 6 6 1 1 1 1 1 1 1 1 1 1
symmnumber: 1
zpe: 473874.7 jmol-1
zpe.correction: 0.180489 hartree
zpe.thermalcorrener: 0.193206 hartree
zpe.thermalcorrenthalpy: 0.194150 hartree
zpe.thermalcorrgfe: 0.138328 hartree
zpe.sumelectzpe: -1263.607361 hartree
zpe.sumelectthermal: -1263.594644 hartree
zpe.sumelectthermalent: -1263.593700 hartree
zpe.sumelectthermalfe: -1263.649523 hartree
dipole: 0.1089 -3.8904 0.2823
dipole: 3.9021
quadrupole: -80.2729 -101.5700 -91.5950
quadrupole: 1.7055 3.0564 2.7445
quadrupole: 10.8731 -10.4240 -0.4491 1.7055 3.0564 2.7445
hfenergy: -1263.7878502 hartree
pointgroup: C01 [X(C12H10Cl1P1)]
dipole: -0.075084 -1.5270937 -0.1385711 debye
dipolederiv: -0.3824535 -0.0167942 0.0262011 -0.1498103 -0.6817874 -0.1037209 -0.1256263 -0.4318142 -0.4277884 0.9723582 0.1692605 -0.0669662 0.1415592 1.0085646 -0.0186747 -0.0913183 0.1087758 0.5727407 -0.3237625 -0.0588147 0.0083792 0.0380637 -0.2309481 0.0446645 0.2948333 0.1900164 -0.2054504 0.0344407 -0.1280796 0.027779 0.0178229 -0.2151528 0.0614028 -0.0350981 0.0391689 -0.1943789 -0.100149 -0.1200774 0.0827236 0.0585109 -0.0285142 0.0173148 -0.0852422 -0.0751813 -0.0637548 -0.1821243 0.0307458 0.1136981 0.0276323 -0.117744 -0.0124319 -0.1382856 0.1142724 0.0704695 -0.0008339 0.1150578 -0.0426668 -0.170057 -0.0163782 -0.1321934 0.1987886 -0.047586 -0.0130249 -0.2127732 0.012232 -0.0683067 0.0202854 -0.072852 0.0941789 0.0743297 -0.0142043 -0.0449307 -0.1897378 -0.0441057 -0.0005127 -0.0583947 0.002458 -0.139286 0.0172861 -0.1479264 -0.0214133 -0.0579122 -0.0859369 -0.062756 -0.0997117 -0.0248396 0.1066103 -0.0010346 0.0739527 0.0101907 0.0694927 -0.0549804 0.1132911 -0.0643043 -0.1526757 -0.0107904 0.0829885 0.0035727 -0.1042231 -0.0807758 -0.0060308 0.1187889 -0.0342096 -0.0893146 0.0136299 0.097509 0.0541816 0.1066835 0.0748777 0.081558 -0.0195257 0.066583 -0.0178405 -0.0955068 -0.0031866 -0.0802784 -0.0606068 0.0056373 -0.1222906 0.0565416 -0.105464 -0.0537725 0.0012035 0.0249626 0.0064708 -0.0427128 0.0341097 0.0344105 -0.0690664 0.0640409 0.0952021 0.0125614 -0.0804653 0.0333956 0.0822302 0.1082822 0.0046558 -0.1035402 0.0166613 0.1243987 0.0049607 -0.0779397 -0.0139736 -0.0326954 0.1273525 -0.0120485 0.0064027 0.027866 0.017902 0.1072956 -0.02437 0.0892102 0.048401 0.1475684 0.0409684 0.0386465 0.0338633 0.0806358 -0.0648781 0.0329306 -0.0377011 0.0505615 0.0618372 0.0071622 -0.0272027 -0.0212853 -0.0082401 0.1291285 0.002872 0.1366424 0.0395046 0.0483583 0.0889687 0.0420588 0.1083233 0.0464338 -0.1003518 0.0507515 -0.0994597 -0.0005065 -0.1124525 0.0121478 -0.0773823 0.0153636 0.1072701 0.0489812 -0.0809007 0.0479656 0.0976692 0.0503679 0.0324639 -0.0842769 0.0402284 0.1120268 -0.0356059 -0.1163638 -0.0241107 -0.0680895 -0.0517111 -0.100249 0.0369528 -0.1095455 0.0499957 0.0610381 0.041578 0.0620829 0.1126226 -0.039997 0.1197766 -0.0492608 0.135978 0.0651719 0.0104699 -0.0589988 0.0125275 0.0885021 unknown
polarizability: 206.026255|-7.220465|144.8968345|12.0006364|-1.2849639|126.317074 unknown
InChI: InChI=1S/C12H10P.Cl/c1-3-7-11(8-4-1)13-12-9-5-2-6-10-12;/h1-10H;
charge 0 multiplicity 1
24 atoms
Cl -0.143411 3.042776 0.674985
P  -0.064994 1.416184 -0.960875
C  -1.462137 0.325568 -0.329699
C  1.448718 0.451592 -0.376002
C  -1.294237 -0.729171 0.602595
C  2.037998 -0.409758 -1.338611
C  -2.751939 0.587391 -0.865479
C  2.028155 0.564209 0.910117
C  -2.403538 -1.510686 0.994089
C  3.180923 -1.171956 -1.00591
C  -3.860452 -0.191951 -0.468713
C  3.178914 -0.190524 1.235057
C  -3.687022 -1.242948 0.462043
C  3.753893 -1.063308 0.282425
H  -0.302393 -0.941436 1.015521
H  1.61195 -0.486563 -2.346824
H  -2.886404 1.400937 -1.588671
H  1.592254 1.252136 1.642263
H  -2.267128 -2.325897 1.713246
H  3.625982 -1.837195 -1.753962
H  -4.852149 0.018307 -0.883748
H  3.625706 -0.093233 2.230801
H  -4.545799 -1.850578 0.768943
H  4.646507 -1.645497 0.537208
